{"text_format":"1","workbook":"xlsx","n_sheets":19,"sheets":["Initializing","Getting Started","Instructions","Unblocking Macros","Copyright","Group R","Vertical Glazing","Overhead Glazing","Doors","Flat-Vaulted Ceilings","Walls(above grade)","Floors","Slab on Grade","Below Grade Walls & Slabs","Table 406.2 (WSEC 2015)","Weather","Prototypes","Agreement Not Accepted","UserRegistration"],"not_rendered":{"charts":0,"images":38,"macros":1,"external_links":1,"defined_names":285,"comments":10,"pivot_tables":0},"unopened":[],"bounds":{"document_bytes":16777216,"sheet_cells":100000,"rows_first":2000,"rows_last":500,"rows_between":2000,"halvings":0,"cell_chars":16384,"cell_head_chars":4096},"cells_cut":0,"cells_raw":0,"read":"whole","date_system":"1900"}

{"sheet":"Initializing","index":0,"n_rows":41,"n_cols":10,"rows_kept":41,"cut":false,"hidden":false,"merged":[[40,2,40,7],[41,2,41,7],[35,2,35,7],[36,2,36,7],[37,2,37,7],[38,2,38,7],[39,2,39,7],[29,2,29,7],[30,2,30,7],[32,2,32,7],[31,2,31,7],[33,2,33,7],[27,1,27,7],[28,2,28,7],[25,3,25,7],[14,3,14,7],[2,7,2,11],[3,1,3,7],[4,1,4,7],[6,1,6,7],[7,1,7,7],[8,1,8,7],[9,1,9,7],[10,2,10,7],[11,3,11,7],[12,3,12,7],[13,2,13,7],[2,2,2,6],[5,1,5,7],[21,2,21,7],[22,3,22,7],[24,3,24,7],[15,2,15,7],[16,3,16,7],[17,3,17,7],[18,3,18,7],[19,3,19,7],[20,3,20,7],[23,3,23,7]]}
[null,null,{"$f":"'Getting Started'!C1","v":"WSU Code Compliance Calculator  - WSEC 2018 & 2021"},null,null,null,null,null,null,"(C) 2025"]
[null,null,{"$f":"'Getting Started'!C2","v":"Washington State University  Energy Program "},null,null,null,null,null,null,{"$f":"VersionDate","v":"2026-06-10T18:45:04"}]
[null,null,{"$f":"'Getting Started'!C3","v":"For assistance contact: energycode@energy.wsu.edu"}]
[null,"Welcome to the WSU Code Compliance Calculator"]
[null,"This worksheet is designed to document the qualification of building designs by the (1) R402.1.1 prescriptive path, including the R406.3 UA percent trade off for Option 1 envelope measures, and (2) R402.1.4 Total UA Alternative (compnent performance).   These are both based on the requirements of the 2021 and the 2018 editions of the Washington State Energy Code (WSEC). This tool can also calculate Efficient Building Envelope Options 1.3 – 1.6 for 2018 and Options 1.1 –1.4 for 2021."]
[null,"We appreciate your feedback!  Send us your suggestions, comments and bug reports to the email above."]
{"$rows_left_out":36}
{"sheet":"Getting Started","index":1,"n_rows":212,"n_cols":11,"rows_kept":212,"cut":false,"hidden":false,"merged":[[208,1,208,6],[4,2,4,8],[131,1,131,8],[173,1,173,8],[174,1,174,8],[176,1,176,8],[165,1,165,8],[169,1,169,8],[139,1,139,8],[141,1,141,8],[142,1,142,8],[145,1,145,8],[146,1,146,8],[148,1,148,8],[149,1,149,8],[150,1,150,8],[163,1,163,3],[69,1,69,8],[75,1,75,8],[76,1,76,8],[78,1,78,8],[86,1,86,8],[201,1,201,8],[202,2,202,6],[198,2,198,8],[199,2,199,8],[200,2,200,8],[177,1,177,8],[194,1,194,8],[195,1,195,8],[196,2,196,8],[193,1,193,8],[186,1,186,8],[187,1,187,8],[190,1,190,8],[191,1,191,8],[192,1,192,8],[2,2,2,5],[11,1,11,8],[22,1,22,8],[23,1,23,8],[24,2,24,5],[39,3,39,5],[79,1,79,8],[80,2,80,8],[82,1,82,8],[54,1,54,8],[14,3,14,8],[15,3,15,8],[16,3,16,8],[68,1,68,8],[56,1,56,8],[57,1,57,8],[65,1,65,8],[66,1,66,8],[67,1,67,8],[40,1,40,8],[32,2,32,8],[9,1,9,8],[10,1,10,8],[77,1,77,8],[81,1,81,8],[83,1,83,8],[84,1,84,8],[85,1,85,8],[106,1,106,8],[115,1,115,8],[109,1,109,8],[103,1,103,8],[113,1,113,8],[114,1,114,8],[92,1,92,8],[93,1,93,8],[99,1,99,8],[12,2,12,7],[31,2,31,8],[33,1,33,8],[35,2,35,8],[36,2,36,8],[26,1,26,8],[27,2,27,8],[28,2,28,8],[13,1,13,8],[18,3,18,8],[21,3,21,8],[20,3,20,8],[19,3,19,8],[17,3,17,8],[43,1,43,8],[25,1,25,8],[29,1,29,8],[48,1,48,8],[49,1,49,8],[44,1,44,8],[42,1,42,8],[45,1,45,8],[46,1,46,8],[47,1,47,8],[38,2,38,8],[30,2,30,8],[34,2,34,8],[37,2,37,8],[41,2,41,8],[124,1,124,8],[102,1,102,8],[107,1,107,8],[111,1,111,8],[110,1,110,8],[117,1,117,8],[101,1,101,8],[108,1,108,8],[118,1,118,8],[210,2,210,7],[119,1,119,8],[116,1,116,8],[205,2,205,6],[203,2,203,7],[204,2,204,7],[206,2,206,7],[164,1,164,3],[164,4,164,8],[166,1,166,8],[168,1,168,8],[167,1,167,8],[182,1,182,8],[183,1,183,8],[184,1,184,8],[185,3,185,8],[152,1,152,8],[153,2,153,9],[157,1,157,8],[158,2,158,9],[125,1,125,8],[126,1,126,8],[171,1,171,8],[197,2,197,8],[211,2,211,7],[120,1,120,8],[121,1,121,8],[122,1,122,8],[123,1,123,8],[138,1,138,8],[136,1,136,8],[133,1,133,8],[134,1,134,8],[135,1,135,8],[128,1,128,8],[162,1,162,8],[163,4,163,8],[151,1,151,8],[155,1,155,8],[156,1,156,8],[160,1,160,8],[161,1,161,8],[143,2,143,9],[179,1,179,8],[180,1,180,8],[130,1,130,8],[209,2,209,7],[170,1,170,8]]}
[null,null,"WSU Code Compliance Calculator  - WSEC 2018 & 2021",null,null,null,null,null,null,{"$f":"Initializing!J1","v":"(C) 2025"}]
[null,null,"Washington State University  Energy Program ",null,null,null,null,null,null,{"$f":"VersionDate","v":"2026-06-10T18:45:04"}]
[null,null,"For assistance contact: energycode@energy.wsu.edu"]
[null,null,{"$f":"IF(MacroMessage=\"\",\"\",MacroMessage)","v":"ENABLE MACROS: Macros must be enabled for this tool to function properly."}]
[null,null,{"$f":"IF(IntroMessage2=\"\",\"\",Initializing!B8)","v":"Office 365 Users:  Save this file to your LOCAL drive.  To unblock macros, follow the instructions on the Unblocking Macros tab."}]
[]
{"$rows_left_out":207}
{"sheet":"Instructions","index":2,"n_rows":126,"n_cols":1,"rows_kept":126,"cut":false,"hidden":true,"merged":[]}
["Component Performance Worksheet (CPWorksheet) "]
[]
["These worksheets are designed to document the qualification of building designs by the component performance approach described in the 2015 and 2018 edition, Washington State Energy Code (WSEC)."]
[]
["These instructions do not attempt to teach the requirements of the WSEC.  If you need an overview of the Code, we recommend that you begin by looking at the resources contained on the WSU Energy Program website: www.energy.wsu.edu/code. "]
[]
{"$rows_left_out":121}
{"sheet":"Unblocking Macros","index":3,"n_rows":16,"n_cols":10,"rows_kept":16,"cut":false,"hidden":false,"merged":[[2,2,2,6],[2,7,2,11],[12,2,12,7],[13,2,13,7],[9,1,9,6],[11,1,11,6],[7,1,7,7],[8,1,8,7],[14,2,14,7],[15,2,15,7],[16,2,16,7],[4,1,4,6],[3,2,3,7],[6,1,6,8],[5,1,5,6]]}
[null,null,{"$f":"'Getting Started'!C1","v":"WSU Code Compliance Calculator  - WSEC 2018 & 2021"},null,null,null,null,null,null,"(C) 2024"]
[null,null,{"$f":"'Getting Started'!C2","v":"Washington State University  Energy Program "},null,null,null,null,null,null,{"$f":"VersionDate","v":"2026-06-10T18:45:04"}]
[null,null,{"$f":"'Getting Started'!C3","v":"For assistance contact: energycode@energy.wsu.edu"}]
[null,null,{"$f":"IF('Getting Started'!C178=\"\",\"\",'Getting Started'!C178)","v":""}]
[null,"This tool is compatible with Office 365 "]
[null,"This tool is compatible with Office 365.  However, it will not work if you open the calculator within Microsoft Edge.  Save the file to your local drive. "]
{"$rows_left_out":11}
{"sheet":"Copyright","index":4,"n_rows":103,"n_cols":8,"rows_kept":103,"cut":false,"hidden":false,"merged":[[1,6,1,12],[2,6,3,11]]}
[null,{"$f":"Initializing!C1","v":"WSU Code Compliance Calculator  - WSEC 2018 & 2021"},null,null,null,null,"ENABLE MACROS: Macros must be enabled for this tool to function properly."]
[null,"Version: WSU_C32021_20260610a~Master.xlsm, 6/10/2026 6:45:04 PM",null,null,null,null,"Office 365 Users:  Save this file to your LOCAL drive."]
[null,"Tool Revision Date:","2026-06-10T18:45:04",null,null,null,"Calculator tabs will open after macros are enabled and terms of use are accepted."]
[null,"Your Excel Version: ",2019]
[]
[]
{"$rows_left_out":98}
{"sheet":"Group R","index":5,"n_rows":944,"n_cols":97,"rows_kept":944,"cut":false,"hidden":true,"merged":[[46,2,46,3],[47,2,47,3],[29,10,29,11],[35,10,35,11],[51,9,51,10],[50,11,50,15],[52,9,52,10],[50,4,50,6],[46,7,46,10],[50,9,50,10],[52,7,52,8],[46,11,46,12],[45,3,45,13],[47,11,47,12],[47,7,47,10],[49,3,49,13],[46,13,46,14],[50,7,50,8],[51,7,51,8],[51,11,51,15],[52,11,52,15],[50,2,50,3],[52,2,52,3],[52,4,52,6],[282,5,282,8],[1,12,1,13],[1,14,1,15],[30,10,30,11],[31,10,31,11],[32,10,32,11],[33,10,33,11],[34,10,34,11],[36,10,36,11],[26,10,26,13],[16,5,16,11],[27,10,27,11],[26,5,26,7],[17,5,17,8],[18,5,18,8],[19,5,19,8],[28,10,28,11],[55,7,55,8],[47,13,47,14],[46,4,46,6],[47,4,47,6],[53,4,53,6],[54,7,54,8],[272,5,272,8],[101,28,102,28],[170,28,171,28],[56,7,56,8],[58,7,58,8],[57,7,57,8],[60,7,60,8],[57,9,57,10],[60,9,60,10],[101,25,101,26],[101,27,102,27],[59,7,59,8],[89,28,90,28],[170,27,171,27],[101,13,102,13],[101,22,102,22],[101,23,101,24],[59,11,59,15],[60,11,60,15],[67,20,67,27],[170,13,171,13],[208,27,209,27],[55,4,55,6],[222,25,222,26],[220,10,220,11],[223,25,223,26],[219,27,220,27],[101,20,102,20],[170,20,171,20],[71,23,71,24],[71,25,71,26],[84,22,84,26],[89,20,90,20],[89,22,90,22],[89,23,89,24],[89,25,89,26],[96,22,96,26],[89,27,90,27],[181,27,182,27],[191,22,191,26],[197,27,198,27],[176,22,176,26],[203,22,203,26],[214,22,214,26],[170,12,171,12],[258,3,258,5],[259,3,259,5],[260,3,260,5],[255,6,255,9],[270,1,270,4],[181,12,182,12],[197,12,198,12],[191,7,191,11],[265,3,265,5],[231,6,231,7],[203,7,203,11],[246,5,246,6],[257,3,257,5],[245,5,245,6],[251,1,251,4],[240,1,240,4],[230,6,230,7],[208,12,209,12],[283,20,283,23],[224,10,224,11],[221,10,221,11],[222,10,222,11],[223,10,223,11],[219,10,219,11],[282,20,282,23],[224,25,224,26],[219,25,219,26],[220,25,220,26],[221,25,221,26],[219,12,220,12],[229,9,229,15],[51,4,51,6],[53,2,53,3],[264,3,264,5],[253,6,253,9],[214,7,214,11],[60,2,60,3],[60,4,60,6],[62,8,62,15],[51,2,51,3],[53,7,53,8],[54,2,54,3],[176,7,176,11],[59,2,59,3],[58,9,58,10],[56,4,56,6],[58,4,58,6],[57,4,57,6],[56,2,56,3],[58,2,58,3],[57,2,57,3],[55,2,55,3],[170,5,171,5],[54,4,54,6],[54,9,54,10],[54,11,54,15],[61,2,61,3],[101,5,102,5],[89,5,90,5],[89,10,89,11],[67,4,67,6],[67,7,67,14],[71,10,71,11],[101,12,102,12],[89,8,89,9],[101,7,102,7],[96,7,96,11],[89,7,90,7],[89,13,90,13],[89,12,90,12],[101,10,101,11],[61,9,61,10],[101,8,101,9],[14,6,14,15],[681,15,681,16],[71,8,71,9],[252,8,252,14],[254,6,254,9],[271,8,271,14],[53,11,53,15],[55,11,55,15],[56,11,56,15],[53,9,53,10],[56,9,56,10],[58,11,58,15],[55,9,55,10],[57,11,57,15],[59,9,59,10],[229,6,229,7],[235,6,235,7],[233,6,233,7],[234,6,234,7],[236,6,236,7],[680,11,680,12],[680,13,680,14],[681,11,681,12],[681,13,681,14]]}
[null,null,null,{"$f":"IF(MacroMessage=\"\",\"\",MacroMessage)","v":"ENABLE MACROS: Macros must be enabled for this tool to function properly."},null,null,null,null,null,null,null,null,null,null,null,null,null,null,{"$f":"IFERROR(CONCATENATE(\"UA Red=\",ROUND(N43,1),\"  (\",ROUND(N42*100,1),\"%)\"),\"--\")","v":"UA Red=39.8  (14.5%)"},null,null,null,null,null,null,null,null,null,null,null,null,null,null,null,null,null,"Prototypes"]
[null,null,{"$f":"'Getting Started'!$C$1","v":"WSU Code Compliance Calculator  - WSEC 2018 & 2021"},null,null,null,null,null,null,null,null,null,"Inputs",null,"Results",null,null,null,null,null,null,null,null,null,null,null,null,null,null,null,null,null,null,null,null,null,"id_prototypes","prototype","Tons","Furnsize","SDloc","SDArea","RDloc","RDArea","Afloorcon","Volume","Afloorext","Aextwall","Aceiling","AwinN","AwinE","AwinS","AwinW","Adoor","Foundtype","Afootprint","Pfootprint","HeightAG","HeightBG","StackHeight","FanCFM","achattic","achcrawl","WH","WH_size","HPWH_performance","ducted","WH_fan","WH_loc","InteractionFactor","prototype_desc","btype","occupants_per_unit","occupants","numunits","height_per_floor","floors_per_building","total_height","baseductsinside","bedrooms_per_unit","reqvent","glazing_pct_hfa","perim_width","perim_length","seemtemplate_sort","official_rtf_prototype","sqft_per_unit","sizecat","fan_cfm_per_unit","wh_size_per_unit","floor_ins_area","wall_ins_area","bsmtwall_ins_area","window_area","slab_area","wall_to_floor_area","duct_area"]
[null,null,null,null,null,null,null,null,null,null,null,null,null,null,null,null,null,null,null,null,null,null,null,null,null,null,null,null,null,null,null,null,null,null,null,null,1,"c1344",2.5,17.584272626562804,"Crawl",240,"Attic",50,1344,10752,0,1184,1344,43.68,43.68,43.68,43.68,40,1,1344,148,1,2,8,50,4.5,4.5,1,50,4,0,0,1,0.65,"sf home","sf",2.3918495297805644,2.3918495297805644,1,8,1,8,false,3,70.319999999999993,0.13,32,42,1,true,1344,1500,50,50,1344,969.28,0,174.72,0,0.88095238095238093,290]
[null,null,"Project Information",null,null,null,"Messages / Comments *",null,null,{"$f":"IF(Menu_UseOfCalculator=MenuItem_UserDefinedBaseline,\"\",\"RESULT=\")","v":"RESULT="},{"$f":"IFERROR(IF(Menu_UseOfCalculator=MenuItem_UserDefinedBaseline,\"\",J343),\"\")","v":"PASS"},null,null,null,null,null,null,null,"User Work Area",null,null,null,null,null,null,null,null,null,null,null,null,null,null,null,null,null,2,"s1344",2.5,17.584272626562804,"Attic",240,"Attic",50,1344,10752,0,1184,1344,43.68,43.68,43.68,43.68,40,2,1344,148,0,0,8,50,4.5,4.5,1,50,4,0,0,1,0.65,"sf home","sf",2.3918495297805644,2.3918495297805644,1,8,1,8,false,3,70.319999999999993,0.13,32,42,1,true,1344,1500,50,50,0,969.28,0,174.72,1344,0.88095238095238093,290]
[null,null,null,"2100 sq. ft. single family medium dwelling unit",null,null,{"$f":"IF(AND(K4=\"Pass\",Menu_UseOfCalculator=Item_Use_CompleteForms),\"Credit requirements are met\",IF(Menu_UseOfCalculator=MenuItem_NonDwellingUnit,\"-\",IF(OR(AND(H39>0,N39>0,H66>0),Menu_UseOfCalculator=Item_Use_CompleteForms),IF(N40<H40,\"Credit requirements are not met.  Select energy credits from Tables 406.2 and 406.3 below\",\"\"),\"\")))","v":""},null,null,null,null,null,null,null,null,null,null,null,null,null,null,null,null,null,null,null,null,null,null,null,null,null,null,null,null,null,3,"c2200",4,23.445696835417071,"Crawl",300,"Attic",80,2200,18700,200,2210,1784,91.300000000000011,91.300000000000011,91.300000000000011,91.300000000000011,40,1,1584,160,1,2,17,50,4.5,4.5,1,50,4,0,0,1,0.65,"sf home","sf",2.7944162436548226,2.7944162436548226,1,8.5,2,17,false,4,103.5,0.16600000000000001,36,44,2,true,2200,5000,50,50,1784,1804.8,0,365.20000000000005,0,1.0045454545454546,380]
[null,null,null,null,null,null,{"$f":"IF(Menu_UseOfCalculator<>Item_Use_CompleteForms,G364,\"\")","v":""},null,null,null,null,null,null,null,null,null,null,null,null,null,null,null,null,null,null,null,null,null,null,null,null,null,null,null,null,null,4,"s2200",4,23.445696835417071,"Attic",300,"Attic",80,2200,18700,200,2210,1784,91.300000000000011,91.300000000000011,91.300000000000011,91.300000000000011,40,2,1584,160,0,0,17,50,4.5,4.5,1,50,4,0,0,1,0.65,"sf home","sf",2.7944162436548226,2.7944162436548226,1,8.5,2,17,false,4,103.5,0.16600000000000001,36,44,2,true,2200,5000,50,50,200,1804.8,0,365.20000000000005,1584,1.0045454545454546,380]
{"$rows_left_out":939}
{"sheet":"Vertical Glazing","index":6,"n_rows":384,"n_cols":6,"rows_kept":384,"cut":false,"hidden":true,"merged":[]}
["WSU Code Compliance Calculator  - WSEC 2015 &2018",null,null,null,null,"(C) 2020"]
["Vertical Glazing Database"]
["Index","Component Description","Reference","Glazing U"]
[]
[1]
[{"$f":"A5+1","v":2},"=== Most Frequently Used ========= "]
{"$rows_left_out":379}
{"sheet":"Overhead Glazing","index":7,"n_rows":2020,"n_cols":6,"rows_kept":2020,"cut":false,"hidden":true,"merged":[]}
["WSU Code Compliance Calculator  - WSEC 2015 &2018",null,null,null,null,"(C) 2020"]
["Overhead Glazing Database"]
["Index","Component Description","Reference","Glazing U"]
[]
[1]
[{"$f":"A5+1","v":2},"=== Most Frequently Used ========= "]
{"$rows_left_out":2015}
{"sheet":"Doors","index":8,"n_rows":118,"n_cols":6,"rows_kept":118,"cut":false,"hidden":true,"merged":[]}
["WSU Code Compliance Calculator  - WSEC 2015 &2018",null,null,null,null,"(C) 2020"]
["Door Database"]
["Index","Component Description","Reference","U-Value"]
[]
[1,null,0,0]
[{"$f":"A5+1","v":2},"=== Most Frequently Used ========= "]
{"$rows_left_out":113}
{"sheet":"Flat-Vaulted Ceilings","index":9,"n_rows":379,"n_cols":6,"rows_kept":379,"cut":false,"hidden":true,"merged":[]}
["WSU Code Compliance Calculator  - WSEC 2015 &2018",null,null,null,null,"(C) 2020"]
["Flat & Vaulted Ceilings Database"]
["Index","Component Description","Reference","Attic U"]
[]
[1]
[{"$f":"A5+1","v":2},"=== Most Frequently Used ========= "]
{"$rows_left_out":374}
{"sheet":"Walls(above grade)","index":10,"n_rows":989,"n_cols":6,"rows_kept":989,"cut":false,"hidden":true,"merged":[]}
["WSU Code Compliance Calculator  - WSEC 2015 &2018",null,null,null,null,"(C) 2020"]
["Above-Grade Walls Database"]
["Index","Component Description","Reference","Wall U"]
[]
[1]
[{"$f":"A5+1","v":2},"=== Most Frequently Used ========= "]
{"$rows_left_out":984}
{"sheet":"Floors","index":11,"n_rows":117,"n_cols":6,"rows_kept":117,"cut":false,"hidden":true,"merged":[]}
["WSU Code Compliance Calculator  - WSEC 2015 &2018",null,null,null,null,"(C) 2020"]
["Floor Database"]
["Index","Component Description","Reference","Floor U"]
[]
[1]
[{"$f":"A5+1","v":2},"=== Most Frequently Used ========= "]
{"$rows_left_out":112}
{"sheet":"Slab on Grade","index":12,"n_rows":132,"n_cols":13,"rows_kept":132,"cut":false,"hidden":true,"merged":[[117,9,117,10],[117,11,117,12]]}
["WSU Code Compliance Calculator  - WSEC 2015 &2018",null,null,null,null,"(C) 2020"]
["Slab-on-Grade Database"]
["Index","Component Description","Reference","Slab F"]
[]
[1]
[{"$f":"A5+1","v":2},"=== Most Frequently Used ========= "]
{"$rows_left_out":127}
{"sheet":"Below Grade Walls & Slabs","index":13,"n_rows":206,"n_cols":14,"rows_kept":206,"cut":false,"hidden":true,"merged":[]}
["WSU Code Compliance Calculator  - WSEC 2015 &2018",null,null,null,null,null,"(C) 2020"]
["Below Grade Walls and Slabs - Updated to WSEC 2018, Appendix A, Table A104.1 (values changed from WSEC 2015 Appendix A)"]
["Index",null,"Component Description","Reference","Wall U","Slab F"]
[1,null,1,2,3,4,null,null,null,null,null,null,null,"Figures from:  Baylon & Kennedy, https://web.ornl.gov/sci/buildings/conf-archive/2007%20B10%20papers/092_Baylon.pdf"]
[{"$f":"A4+1","v":2},null,"=== Most Frequently Used ========= "]
[{"$f":"A5+1","v":3},"2' depth",{"$f":"'Below Grade Walls & Slabs'!F159","v":"R0  Uninsulated, 2' depth"},{"$f":"'Below Grade Walls & Slabs'!D159","v":"10-1"},{"$f":"VLOOKUP($C6,$C$28:$F$118,E$4,FALSE)","v":0.33100000000000002},0.57999999999999996,{"$f":"'Below Grade Walls & Slabs'!E159","v":"Updated to WSEC 2018"}]
{"$rows_left_out":201}
{"sheet":"Table 406.2 (WSEC 2015)","index":14,"n_rows":119,"n_cols":3,"rows_kept":119,"cut":false,"hidden":true,"merged":[[113,1,113,2],[114,1,114,2],[115,1,115,2],[117,1,117,2],[118,1,118,2],[116,1,116,2],[10,0,10,2],[12,0,12,2],[13,0,13,2],[16,0,16,2],[2,0,2,2],[4,0,4,2],[6,0,6,2],[7,0,7,2],[9,0,9,2],[78,0,84,0],[78,2,84,2],[85,0,87,0],[85,2,87,2],[88,0,95,0],[88,2,95,2],[96,0,103,0],[96,2,103,2],[104,0,106,0],[104,2,106,2],[107,0,112,0],[107,2,112,2],[67,0,69,0],[67,2,69,2],[70,0,74,0],[70,2,74,2],[75,0,77,0],[75,2,77,2],[53,0,57,0],[53,2,57,2],[58,0,62,0],[58,2,62,2],[63,0,66,0],[63,2,66,2],[45,0,47,0],[45,2,47,2],[48,0,52,0],[48,2,52,2],[17,0,24,0],[17,2,24,2],[25,0,34,0],[25,2,34,2],[35,0,44,0],[35,2,44,2]]}
["SECTION R406"]
[]
["R406.1 Scope. This section establishes options for additional criteria to be met for one- and two-family dwellings and townhouses, as defined in Section 101.2 of the International Residential Code to demonstrate compliance with this code."]
[]
["R406.2 Additional energy efficiency requirements (Mandatory). Each dwelling unit in a residential building shall comply with sufficient options from Table R406.2 so as to achieve the following minimum number of credits:"]
["1.    Small Dwelling Unit: ","1.5 credits"]
{"$rows_left_out":114}
{"sheet":"Weather","index":15,"n_rows":240,"n_cols":6,"rows_kept":240,"cut":false,"hidden":true,"merged":[]}
["WSU Code Compliance Calculator  - WSEC 2015 &2018",null,null,null,null,"(C) 2020"]
["Weather Database - Heating Design Temperature by City, Washington State"]
["Index","Location","Heating","Design"]
[null,null,"Design","Temp"]
[null,null,"Temp","Difference"]
[1]
{"$rows_left_out":235}
{"sheet":"Prototypes","index":16,"n_rows":20,"n_cols":61,"rows_kept":20,"cut":false,"hidden":true,"merged":[]}
[]
["Prototypes"]
["id_prototypes","prototype","Tons","Furnsize","Supply Duct location","Supply Duct Area","Return Duct location","Return Duct Area","Afloorcon","Volume","Afloorext","Aextwall","Aceiling","AwinN","AwinE","AwinS","AwinW","Adoor","Foundtype","Afootprint","Pfootprint","HeightAG","HeightBG","StackHeight","FanCFM","achattic","achcrawl","WH","WH_size","HPWH_performance","ducted","WH_fan","WH_loc","InteractionFactor","prototype_desc","btype","occupants_per_unit","occupants","numunits","height_per_floor","floors_per_building","total_height","baseductsinside","bedrooms_per_unit","reqvent","glazing_pct_hfa","perim_width","perim_length","seemtemplate_sort","official_rtf_prototype","sqft_per_unit","sizecat","fan_cfm_per_unit","wh_size_per_unit","floor_ins_area","wall_ins_area","bsmtwall_ins_area","window_area","slab_area","wall_to_floor_area","duct_area"]
[1,"c1344",2.5,17.584272626562804,"Crawl",240,"Attic",50,1344,10752,0,1184,1344,43.68,43.68,43.68,43.68,40,1,1344,148,1,2,8,50,4.5,4.5,1,50,4,0,0,1,0.65,"sf home","sf",2.3918495297805644,2.3918495297805644,1,8,1,8,false,3,70.319999999999993,0.13,32,42,1,true,1344,1500,50,50,1344,969.28,0,174.72,0,0.88095238095238093,290]
[2,"s1344",2.5,17.584272626562804,"Attic",240,"Attic",50,1344,10752,0,1184,1344,43.68,43.68,43.68,43.68,40,2,1344,148,0,0,8,50,4.5,4.5,1,50,4,0,0,1,0.65,"sf home","sf",2.3918495297805644,2.3918495297805644,1,8,1,8,false,3,70.319999999999993,0.13,32,42,1,true,1344,1500,50,50,0,969.28,0,174.72,1344,0.88095238095238093,290]
[3,"c2200",4,23.445696835417071,"Crawl",300,"Attic",80,2200,18700,200,2210,1784,91.300000000000011,91.300000000000011,91.300000000000011,91.300000000000011,40,1,1584,160,1,2,17,50,4.5,4.5,1,50,4,0,0,1,0.65,"sf home","sf",2.7944162436548226,2.7944162436548226,1,8.5,2,17,false,4,103.5,0.16600000000000001,36,44,2,true,2200,5000,50,50,1784,1804.8,0,365.20000000000005,0,1.0045454545454546,380]
{"$rows_left_out":15}
{"sheet":"Agreement Not Accepted","index":17,"n_rows":12,"n_cols":2,"rows_kept":12,"cut":false,"hidden":true,"merged":[]}
[]
[null,"Total UA Alternative Calculator"]
[]
[null,"Terms of use were not accepted. "]
[]
[null," Please click on \"Review & Accept Terms of Use\" button below to try again. "]
{"$rows_left_out":7}
{"sheet":"UserRegistration","index":18,"n_rows":17,"n_cols":2,"rows_kept":17,"cut":false,"hidden":true,"merged":[]}
["User Registration",{"$f":"'Group R'!E2","v":0}]
[]
["First Name","Carolyn"]
["Last Name","Roos"]
["Registration Date:","2020-08-15"]
["Version","Version: 2015-2018 Total UA Alternative Worksheet~20200814a~C2200-1.xlsm, 8/14/2020 7:04:19 PM"]
{"$rows_left_out":11}