{"text_format":"1","workbook":"xlsx","n_sheets":19,"sheets":["Initializing","Getting Started","Instructions","Unblocking Macros","Copyright","Group R","Vertical Glazing","Overhead Glazing","Doors","Flat-Vaulted Ceilings","Walls(above grade)","Floors","Slab on Grade","Below Grade Walls & Slabs","Table 406.2 (WSEC 2015)","Weather","Prototypes","Agreement Not Accepted","UserRegistration"],"not_rendered":{"charts":0,"images":38,"macros":1,"external_links":1,"defined_names":285,"comments":10,"pivot_tables":0},"unopened":[],"bounds":{"document_bytes":16777216,"sheet_cells":100000,"rows_first":2000,"rows_last":500,"rows_between":2000,"halvings":0,"cell_chars":16384,"cell_head_chars":4096},"cells_cut":0,"cells_raw":0,"read":"whole","date_system":"1900"}

{"sheet":"Initializing","index":0,"n_rows":41,"n_cols":10,"rows_kept":41,"cut":false,"hidden":false,"merged":[[40,2,40,7],[41,2,41,7],[35,2,35,7],[36,2,36,7],[37,2,37,7],[38,2,38,7],[39,2,39,7],[29,2,29,7],[30,2,30,7],[32,2,32,7],[31,2,31,7],[33,2,33,7],[27,1,27,7],[28,2,28,7],[25,3,25,7],[14,3,14,7],[2,7,2,11],[3,1,3,7],[4,1,4,7],[6,1,6,7],[7,1,7,7],[8,1,8,7],[9,1,9,7],[10,2,10,7],[11,3,11,7],[12,3,12,7],[13,2,13,7],[2,2,2,6],[5,1,5,7],[21,2,21,7],[22,3,22,7],[24,3,24,7],[15,2,15,7],[16,3,16,7],[17,3,17,7],[18,3,18,7],[19,3,19,7],[20,3,20,7],[23,3,23,7]]}
[null,null,{"$f":"'Getting Started'!C1","v":"WSU Code Compliance Calculator  - WSEC 2018 & 2021"},null,null,null,null,null,null,"(C) 2025"]
[null,null,{"$f":"'Getting Started'!C2","v":"Washington State University  Energy Program "},null,null,null,null,null,null,{"$f":"VersionDate","v":"2026-06-10T18:45:04"}]
[null,null,{"$f":"'Getting Started'!C3","v":"For assistance contact: energycode@energy.wsu.edu"}]
[null,"Welcome to the WSU Code Compliance Calculator"]
[null,"This worksheet is designed to document the qualification of building designs by the (1) R402.1.1 prescriptive path, including the R406.3 UA percent trade off for Option 1 envelope measures, and (2) R402.1.4 Total UA Alternative (compnent performance).   These are both based on the requirements of the 2021 and the 2018 editions of the Washington State Energy Code (WSEC). This tool can also calculate Efficient Building Envelope Options 1.3 – 1.6 for 2018 and Options 1.1 –1.4 for 2021."]
[null,"We appreciate your feedback!  Send us your suggestions, comments and bug reports to the email above."]
[null,"ENABLE MACROS: Macros must be enabled for this tool to function properly."]
[null,"Office 365 Users:  Save this file to your LOCAL drive.  To unblock macros, follow the instructions on the Unblocking Macros tab."]
[null,"Calculator tabs will open when macros are enabled and you click button to Accept Terms."]
[null,"If the tool does not open:"]
[null,"*","Have you enabled editing?  Have you enabled macros?  Have you saved to your harddrive?"]
[null,null,"-","See the text box \"Excel Start Up Tips\" to the right"]
[null,null,"-","If you missed clicking \"Enable Macros\" just below the Excel ribbon, close this file and open again."]
[null,"*","What is your Excel version?  This tool is not compatible with Excel for Mac or web-based versions of Excel."]
[null,null,"-","Include your Excel version when you email us"]
[null,"*","Is VBA installed in your Office installation? If not, on a PC follow these steps:"]
[null,null,1,"Go to the Control Panel --> Programs --> Programs and Features"]
[null,null,2,"Find Microsoft Offcie in the list of programs.  Right click it and select Change"]
[null,null,3,"In the window that opens, choose Add or Remove Features"]
[null,null,4,"In the next window, go to Installation Options -> Office Shared features, click Visual Basic for Applications and select Run from My Computer."]
[null,null,5,"Click Continue and restart Excel."]
[null,"*","Your antivirus may be removing VBA code or disabling macro-enabled Excel files or forcing the file to close"]
[null,null,"-","If Excel brings up an error message that includes  \"Removed Part: /xl/vbaProject.bin part\", your antivirus may be removing VBA code from Excel files"]
[null,null,"-","Another indication that the system is blocking macro-enabled Excel files is if the file is \"forced to close\" before you even have a chance to enable macros or accept the user agreement. "]
[null,null,"-","If you get this warning, you may need to work with your IT department to allow running this file."]
[null,null,"-","Please let us know what anti-virus you are using."]
[]
[null,"Tips / Known Issues"]
[null,{"$f":"IF('Getting Started'!B203=\"\",\"\",'Getting Started'!B203)","v":"* "},{"$f":"IF('Getting Started'!C203=\"\",\"\",'Getting Started'!C203)","v":"Print button does not work in pre-2016 versions of Excel "}]
[null,{"$f":"IF('Getting Started'!B204=\"\",\"\",'Getting Started'!B204)","v":""},{"$f":"IF('Getting Started'!C204=\"\",\"\",'Getting Started'!C204)","v":"- Temporary Solution:  Print using the Excel Tool Bar:  File / Print"}]
[null,{"$f":"IF('Getting Started'!B205=\"\",\"\",'Getting Started'!B205)","v":""},{"$f":"IF('Getting Started'!C205=\"\",\"\",'Getting Started'!C205)","v":"- We plan to fix this issue.  Stay tuned -- and thanks for your patience."}]
[null,{"$f":"IF('Getting Started'!B206=\"\",\"\",'Getting Started'!B206)","v":"* "},{"$f":"IF('Getting Started'!C206=\"\",\"\",'Getting Started'!C206)","v":"This tool is not compatible with Excel for Mac"}]
[null,{"$f":"IF('Getting Started'!B207=\"\",\"\",'Getting Started'!B207)","v":""},{"$f":"IF('Getting Started'!C207=\"\",\"\",'Getting Started'!C207)","v":"- Sorry, we do not have plans to develop a Mac compatible tool."}]
[null,null,{"$f":"IF('Getting Started'!B209=\"\",\"\",'Getting Started'!B209)","v":"This tool is compatible with Office 365  -- How to unblock macros"}]
[null,{"$f":"IF('Getting Started'!B209=\"\",\"\",'Getting Started'!B209)","v":"This tool is compatible with Office 365  -- How to unblock macros"}]
[null,{"$f":"IF('Getting Started'!B210=\"\",\"\",'Getting Started'!B210)","v":"*"},{"$f":"IF('Getting Started'!C210=\"\",\"\",'Getting Started'!C210)","v":"However, it will not work if you open the calculator within Microsoft Edge.  Save the file to your local drive."}]
[null,{"$f":"IF('Getting Started'!B211=\"\",\"\",'Getting Started'!B211)","v":"*"},{"$f":"IF('Getting Started'!C211=\"\",\"\",'Getting Started'!C211)","v":"Enabling macros requires that you change the properties of the file to unblock macros.   Follow the instructions in the link that comes up when you try to open the file."}]
[null,{"$f":"IF('Getting Started'!B212=\"\",\"\",'Getting Started'!B212)","v":"*"},{"$f":"IF('Getting Started'!C212=\"\",\"\",'Getting Started'!C212)","v":"Here is a screenshot of Microsoft's instructions for modifying the file properties."}]
[null,{"$f":"IF('Getting Started'!B213=\"\",\"\",'Getting Started'!B213)","v":""},{"$f":"IF('Getting Started'!C214=\"\",\"\",'Getting Started'!C214)","v":""}]
[null,{"$f":"IF('Getting Started'!B214=\"\",\"\",'Getting Started'!B214)","v":""},{"$f":"IF('Getting Started'!C215=\"\",\"\",'Getting Started'!C215)","v":""}]
[null,{"$f":"IF('Getting Started'!B215=\"\",\"\",'Getting Started'!B215)","v":""},{"$f":"IF('Getting Started'!C216=\"\",\"\",'Getting Started'!C216)","v":""}]

{"sheet":"Getting Started","index":1,"n_rows":212,"n_cols":11,"rows_kept":212,"cut":false,"hidden":false,"merged":[[208,1,208,6],[4,2,4,8],[131,1,131,8],[173,1,173,8],[174,1,174,8],[176,1,176,8],[165,1,165,8],[169,1,169,8],[139,1,139,8],[141,1,141,8],[142,1,142,8],[145,1,145,8],[146,1,146,8],[148,1,148,8],[149,1,149,8],[150,1,150,8],[163,1,163,3],[69,1,69,8],[75,1,75,8],[76,1,76,8],[78,1,78,8],[86,1,86,8],[201,1,201,8],[202,2,202,6],[198,2,198,8],[199,2,199,8],[200,2,200,8],[177,1,177,8],[194,1,194,8],[195,1,195,8],[196,2,196,8],[193,1,193,8],[186,1,186,8],[187,1,187,8],[190,1,190,8],[191,1,191,8],[192,1,192,8],[2,2,2,5],[11,1,11,8],[22,1,22,8],[23,1,23,8],[24,2,24,5],[39,3,39,5],[79,1,79,8],[80,2,80,8],[82,1,82,8],[54,1,54,8],[14,3,14,8],[15,3,15,8],[16,3,16,8],[68,1,68,8],[56,1,56,8],[57,1,57,8],[65,1,65,8],[66,1,66,8],[67,1,67,8],[40,1,40,8],[32,2,32,8],[9,1,9,8],[10,1,10,8],[77,1,77,8],[81,1,81,8],[83,1,83,8],[84,1,84,8],[85,1,85,8],[106,1,106,8],[115,1,115,8],[109,1,109,8],[103,1,103,8],[113,1,113,8],[114,1,114,8],[92,1,92,8],[93,1,93,8],[99,1,99,8],[12,2,12,7],[31,2,31,8],[33,1,33,8],[35,2,35,8],[36,2,36,8],[26,1,26,8],[27,2,27,8],[28,2,28,8],[13,1,13,8],[18,3,18,8],[21,3,21,8],[20,3,20,8],[19,3,19,8],[17,3,17,8],[43,1,43,8],[25,1,25,8],[29,1,29,8],[48,1,48,8],[49,1,49,8],[44,1,44,8],[42,1,42,8],[45,1,45,8],[46,1,46,8],[47,1,47,8],[38,2,38,8],[30,2,30,8],[34,2,34,8],[37,2,37,8],[41,2,41,8],[124,1,124,8],[102,1,102,8],[107,1,107,8],[111,1,111,8],[110,1,110,8],[117,1,117,8],[101,1,101,8],[108,1,108,8],[118,1,118,8],[210,2,210,7],[119,1,119,8],[116,1,116,8],[205,2,205,6],[203,2,203,7],[204,2,204,7],[206,2,206,7],[164,1,164,3],[164,4,164,8],[166,1,166,8],[168,1,168,8],[167,1,167,8],[182,1,182,8],[183,1,183,8],[184,1,184,8],[185,3,185,8],[152,1,152,8],[153,2,153,9],[157,1,157,8],[158,2,158,9],[125,1,125,8],[126,1,126,8],[171,1,171,8],[197,2,197,8],[211,2,211,7],[120,1,120,8],[121,1,121,8],[122,1,122,8],[123,1,123,8],[138,1,138,8],[136,1,136,8],[133,1,133,8],[134,1,134,8],[135,1,135,8],[128,1,128,8],[162,1,162,8],[163,4,163,8],[151,1,151,8],[155,1,155,8],[156,1,156,8],[160,1,160,8],[161,1,161,8],[143,2,143,9],[179,1,179,8],[180,1,180,8],[130,1,130,8],[209,2,209,7],[170,1,170,8]]}
[null,null,"WSU Code Compliance Calculator  - WSEC 2018 & 2021",null,null,null,null,null,null,{"$f":"Initializing!J1","v":"(C) 2025"}]
[null,null,"Washington State University  Energy Program ",null,null,null,null,null,null,{"$f":"VersionDate","v":"2026-06-10T18:45:04"}]
[null,null,"For assistance contact: energycode@energy.wsu.edu"]
[null,null,{"$f":"IF(MacroMessage=\"\",\"\",MacroMessage)","v":"ENABLE MACROS: Macros must be enabled for this tool to function properly."}]
[null,null,{"$f":"IF(IntroMessage2=\"\",\"\",Initializing!B8)","v":"Office 365 Users:  Save this file to your LOCAL drive.  To unblock macros, follow the instructions on the Unblocking Macros tab."}]
[]
[]
[]
[]
[null,"Overview and Background"]
[null,"This worksheet is designed to document the qualification of building designs by the (1) R402.1.1 prescriptive path, including the R406.3 UA percent trade off for Option 1 envelope measures, and (2) R402.1.4 Total UA Alternative (compnent performance).   These are both based on the requirements of the 2021 and the 2018 editions of the Washington State Energy Code (WSEC). This tool can also calculate Efficient Building Envelope Options 1.3 – 1.6 for 2018 and Options 1.1 –1.4 for 2021."]
[null,"This calculator also integrates WSU's glazing schedule and the heating system sizing worksheets.  If using the prescriptive PDF worksheets for compliance, you can use this tool to calculate average weighted fenestration U-factor and areas based on your window/door schedule.   The heating system size for new and existing construction is also estimated.  Note it does not do air conditioning sizing or zonal heating calculations."]
[null,null,"These instructions do not attempt to teach the requirements of the WSEC.  If you need an overview of the Code, we recommend that you begin by looking at the resources contained on the WSU Energy Program website."]
[null,"Resources on the website include:"]
[null,"*","WSU Energy Code Website","http://www.energy.wsu.edu/BuildingEfficiency/EnergyCode.aspx"]
[null,"*","2021 WA State Energy Code","https://sbcc.wa.gov/sites/default/files/2023-04/2021_WSEC_R_1stPrint-1_042623.pdf"]
[null,"*","2018 WA State Energy Code","https://www.sbcc.wa.gov/sites/default/files/2020-02/2018%20WSEC_R%20Final%20package.pdf"]
[null,"*","Prescriptive Checklist 2021","Under development"]
[null,"*","Prescriptive Checklist 2018","http://www.energy.wsu.edu/documents/Prescriptive%20Checklist%202018_rev%2012-4-20.pdf"]
[null,"*","IRC - WA Amendments","https://www.sbcc.wa.gov/sites/default/files/2019-12/2015_IRC_Final_2.pdf#:~:text=Authority%3A%20The%20International%20Residential%20Code%20%28Chapter%2051-51%20WAC%29,reference%20by%20the%20Washington%20State%20Legislature%20in%201974.%20originalAttribute="]
[null,"*","2015 WSEC Appendices","http://www.energy.wsu.edu/Documents/ga_2015WSEC_Appx.pdf"]
[null,"*","Additional Resources","http://www.energy.wsu.edu/BuildingEfficiency/EnergyCode/AdditionalResources.aspx"]
[null,"Send us your feedback"]
[null,"We appreciate your feedback!  Please send email suggestions, comments and bug reports to:"]
[null,null,"energycode@energy.wsu.edu"]
[null,"Options for Code Compliance"]
[null,"The 2021 WSEC-R introduces the U-factor compliance path:"]
[null,"*","U-factor compliance path: In this appraoched dubbed the \"U-factor compliance path\" defined in Section R402.1.2 \"Insulation and fenestration criteria\", calculations of the UA value are based on the home’s proposed design and are compared to the code baseline of the same home with the thermal envelope meeting the U-factors summarized in Table R402.1.2.   This Code Compliance Calculator has been developed to assist you with the UA analysis required by this pathway. "]
[null,null,"If Options 1.2, 1.3 or 1.4 there are two additional baseline requirements to meet compliance based on Section 402.1.5 \"Total UA Alternative\": (1) The maximum vertical glazing percent in the baseline is 15% of the floor area. (2)  Exempt window and door areas.are not allowed.  Otherwise, the baseline does not have a maximum glazing percent and exempt window and door areas are allowed"]
[null,"Both 2018 and 2021 WSEC-R have a Prescriptive Path.  In 2021 WSEC-R it is referred to as the \"R-value Alternative\""]
[null,"*","Prescriptive Path / R-value Alternative: The simplest approach that allows for unlimited glazing in most cases. Refer to insulation minimum R-values and fenestration requirements by component in table R402.1.3 in 2021 WSEC-R and Table R402.1.1 in 2018 WSEC-R.  This path requires compliance with R406 fuel normalization and energy credits, following the prescriptive descriptions of insulation requirements in Option 1 of Table 406.3.  "]
[null,null," If you select this path, you do not need to enter details of your proposed design in this calculator.  Simply select the your Heating System Type and selection Energy Options to meet the required total credits required, per Section R406.  Instead of this calculator, you may use the PDF worksheets available from our website.  Select the single family worksheet for single family, townhomes and additions. Use the multifamily R2 worksheet for low rise multi-family corridor or non-corridor buildings up to three stories. "]
[null,null,"We recommend using the single family and multifamily prescriptive PDF worksheets available from our website for this pathway.  "]
[null,"Both 2018 and 2021 WSEC-R have the following compliance paths:"]
[null,"*","Total UA Alternative Path: In this approach, calculations of the UA value are based on the home’s proposed design and are compared to the code baseline of the same home with insulation values as summarized in Table R402.1.1.  This path requires compliance with R406 fuel normalization and energy credits, using the percent UA reduction values specified in Option 1 in Table R406.3.   This Code Compliance Calculator has been developed to assist you with the UA analysis required by this pathway. "]
[null,null,"Under this path, the maximum vertical glazing percent in the baseline is 15% of the floor area. Also, exempt window and door areas.are not allowed."]
[null,null,"This path is defined in Section R402.1.4 in 2018 WSEC-R and Section R402.1.5 in 2021 WSEC-R"]
[null,"*","R405 Simulated Performance Alternative Path: WSU is not aware that this approach has ever been used. The path relies on energy simulation computer program modeling software. To date, WSU has not identified software that meets the energy simulation software requirements. If you are interested in using this compliance path approach, please contact us at energycode@energy.wsu.edu to discuss this issue before submitting permit forms."]
[null,"*","R407 Passive House Path: This new compliance path in the 2018 WSEC-R allows certified Passive House projects to achieve compliance with WSEC-R. There are requirements for documentation at plan review and final site inspection. See Passive House Northwest for more information.  "]
[null,null,"For more on Passive House visit","https://www.phnw.org/phnw-mission"]
[null,"The Prescriptive Path and the Total UA Alternative Approach require additional energy efficiency requirements as specified in Section R406:"]
[null,"*","R406 Additional Energy Efficiency Requirement: These requirements are based on energy credits and fuel normalization credits required by WSEC-R 2018 and 2021."]
[null,"Getting Started:  The \"Group R\" tab"]
[null,"Set Up Your Analysis"]
[null,"Begin your analysis by answering questions in the \"Analysis Set Up\" area by selecting options from the drop down menus.   Your responses to these questions will set up the input areas below, such that only inputs areas that are relevant to your analysis show and input areas that do not pertain are hidden and ignored.  In other words, this tool is user responsive.  The specific sections that hide and show in response to each question are discussed below. "]
[]
[]
[]
[]
[]
[]
[]
[]
[]
[null,"Inputs are in yellow cells.  The classification and baseline description are automatically determined from your inputs in this section, plus the conditioned floor area (which is entered below.)"]
[]
[null,"Question: \"What code compliance pathway are you using?:"]
[null,"Select one of the three uses of this tool from the drop down. "]
[]
[]
[]
[]
[]
[]
[null,"Options are:"]
[null,"U-Factor Compliance Path / Total UA Alternative - Select this option, if you are using percent reductions in Total conductive UA specified in Table 406.3 to achieve Option 1 Efficient Building Envelope credits.  Your design is compared to the code targets summarized in Table R402.1.1.   Your design is compared to the code targets summarized in Table R402.1.1 in 2018 WSEC-R or Table R402.1.2 in 2021 WSEC-R.   In calcualtion the Percent UA Reduction for Option 1, the maximum baseline window area for comparison is 15% of the floor area.  Exempt wall and window areas are not included, so these input areas hide."]
[null,"User-Defined Baseline - This option is primarily used for remodels / alterations or for additions when doing a trade off with the existing home.   There are exceptions where you would use a user-defined baseline for New Construction, such as when doing a UA trade off on a log home.  An additional input area for building baseline design details opens to the right adjacent to the proposed description on the left.  (Depending on the size of your screen, you may have to scroll right to see the baseline input area.)  "]
[null,"For remodels/alterations, this calculator may be used to determine if the alteration or repair uses \"no more energy than the existing building or structure prior to the alteration or repair\", per Section R503.1.  For additions, a user-defined baseline analysis may be used for a UA trade off analysis using improvements to the existing dwelling unit to achieve energy credits for the addition.   For more about user-defined baselines for additions and remodels/alterations, see \"Project Building Type?\" below."]
[null,"Prescriptive Path (Tables 406.2 and 406.3 Only) - Select this option if you are following the Prescriptive Path and would like to fill out and print Table R406.2 for and Table R406.3 without calculating the UA value or other detailed results.  All input areas for building design details hide, except for the permitted floor area.  Permitted floor area is used to determine the number of energy credits required."]
[null,"Question: \"Project Building Type?\""]
[]
[]
[]
[]
[]
[null,"New Construction - Thermal envelope requirements for new construction of heated residential buildings are per WSEC Section 4.   New construction of dwelling units requires additional energy efficiency credits per Section R406."]
[null,"Additions -  The definition of an addition is \"An extension or increase in the conditioned space floor area or height of a building or structure.\"   Requirements for additions are per Section R502 and requirements for “Alterations” are per Section R503.  Additions require additional energy efficiency credits per Section R406.  Your selection is used with other responses to determine required Energy Credits; in particular additions less than 500 square feet have lower energy credit requirements than new construction of the same size."]
[null,"If you are doing a UA trade-off using improvements to an existing dwelling unit to achieve Option 1 energy credits for an addition, select User-Defined Baseline for your compliance path.  Input areas for exempt wall and window areas hide.  Tables R406.2 and R406.3 show when this option is selected."]
[null,"Remodel/Alteration -  An alteration is defined as any construction, retrofit or renovation to an existing structure, other than repair or addition, that requires a permit.  Alterations do not require additional energy efficiency requirements per Section R406. "]
[null,"In most cases if your project is a remodel that does not include an addition, you should use the simpler spreadsheet available at: "]
[null,null," http://www.energy.wsu.edu/Documents/Alterations%20Remodel%20Worksheet.xlsx"]
[null,"For remodels/alterations, you must select User-Defined Baseline as your compliance pathway.  In conjunction with system design information, this calculator may be used to determine if the alteration or repair uses \"no more energy than the existing building or structure prior to the alteration or repair\", per Section R503.1.  Exempt wall and window areas are not allowed, so these input areas hide.  Alterations do not require additional energy efficiency requirements per Section R406, so Tables R406.2 and R406.3 hide when this option is selected."]
[null,"An example where you use this code compliance calculator is an addition to an existing home where there is also a remodel. "]
[null,"For combined Addition and Alteration -  Select \"Addition\" from the menu and be sure to enter the floor area of the addition.  This is because credit requirements are based on the floor area of the addition.  "]
[null,"For more using improvements to the existing home in a UA trade off analysis per the exception in R502.1.1.1, watch the C3 training video \"Using the C3 Calculator: Small Addition with User-defined Baseline\" available at:"]
[null,"https://www.energy.wsu.edu/BuildingEfficiency/EnergyCode.aspx#Permit"]
[null,"Question: \"Occupancy Type?\""]
[]
[]
[]
[]
[]
[null,"Your selection -- either R2 Multifamily or R3 Single family homes and duplexes -- is used with the permitted floor area and code version to determine the number of Energy Credits required per Section R406."]
[null,"Question: \"Code Version?\""]
[]
[]
[]
[]
[]
[null,"Select the code version -- either WSEC 2021 or WSEC 2018 -- under which your project is permitted.  Your response modifies the options in Table 406.2 and 406.3.  Code version is also used with floor area and project type to determine the number of energy credits required."]
[]
[null,"Table R406.2 and R406.3: Select Energy Credits and Fuel Normalization Credits"]
[null,"Fuel Normalization Credits"]
[null,"If WSEC 2018 is selected, Table 406.2 Fuel Normalization Credits will show.  Select the system type from the drop down menu.  The fuel normalization credit, energy credits from Table R406.3 and their total will show under \"Total Credits\"."]
[]
[]
[null,"If you select an Option 3 energy credit below that is incompatible with the System Type you select, your selection will be automatically changed to a compatible system type.  You will get a pop-up alerting you to the change."]
[null,"Energy Credits"]
[null,"Next select Energy Credits from Table R406.3 using the drop down menus for each option.  Once an option is selected a brief description of the option is shown.  For a complete description, refer to WSEC. The total Energy Credits for your selections is totalled."]
[null,"If an Option 3 energy credits are selected that are inconsistent with your fuel normalization selection above, the fuel normalization selection will automatically adjust to the correct system type."]
[null,"Option 4 credits cannot be used with ductless systems.  Option 4 energy credits will be set to NA if a ductless system is selected in Option 3."]
[null,"For Renewable Electric Energy credits, also enter the annual electrical generation per housing unit of the system in kWh, as calculated using NREL's PVWatts calculator or approved alternate."]
[]
[null,"Enter Thermal Envelope Details"]
[null,"In the next major section, details on the building's thermal envelope are entered, including areas and insulation values for windows, skylights, walls, floor, slab and ceiling or roof."]
[null,"Conditioned Floor Area"]
[null,"The first input is the conditioned floor area of the proposed design.  Note if you have selected to analyze a Remodel/Alteration, there is an identical input to the right for the conditioned floor area of the baseline design.  Floor area is measured from the exterior face of the exterior sheathing of the exterior walls"]
[null,"Per ANSI/RESNET/ICC 301,\"Dimensions shall be measured and rounded to the nearest 1/2 foot and the square footage calculated and rounded to the nearest square foot.  Dimensions shall use exterior measurements starting at the exterior finished surface of the outside wall.\""]
[]
[]
[null,"Exterior Doors"]
[null,"Select the description of up to seven exterior doors from the drop down menu.  Enter the quantity of each door type.  Enter the width and height of the rough opening in feet and inches for each door type.  Optionally enter an ID."]
[null,"If you have selected Prescriptive Path as your code compliance path, an additional input opens for an exempt swinging door up to 24 sq. ft. in rough opening area.  If the allowable area is exceeded, an error message is displayed.  The total area and UA value in this section does not include the exempt door.  On the other hand, the exempt door is included in the Heating System Sizing calculation below, so it is considered in the sizing of the heating equipment."]
[]
[]
[null,"If you have data for doors you will be installing, you can enter a custom description and U-value in the database.  Click on the button \"Go to Custom Input\".  This will take you to the custom area on the Doors tab.  On database tabs, enter a unique description and a NFRC-certified U-value.   Window and door manufacturers can generally provide these tested U-values.  You may be asked to provide manufacturer data as part of your building permit application for any such \"custom\" entries.\n"]
[null,"On the database tab, click on the button \"Return to Input\" to return back to door section of the Group R tab."]
[]
[null,"Your custom entries will automatically appear at the bottom of the drop down menus in the door section on the Group R tab."]
[]
[null,"Overhead Glazing"]
[null,"Enter up to five types of skylights. Enter the quantity, the width and height of the rough opening, and an optional Plan ID.  As for doors, click the button \"Go to Custom Input\" to jump to the database tab Overhead Glazing  to add custom descriptions and NFRC tested U-values."]
[]
[null,"Vertical Glazing"]
[null,"Up to 60 types of vertical glazing can be entered.  Enter the quantity, the width and height of the rough opening, and an optional Plan ID.  As for doors, click the button \"Go to Custom Input\" to jump to the database tab Vertical Glazing to add custom descriptions and NFRC tested U-values."]
[null,"Enter a number of Rows to Show, to reduce the input area if you don't need all 60 available input rows.  Any leftover data in hidden rows is automatically excluded from calculations and ignored."]
[null,"As with exterior doors, if you have selected Prescriptive Path as your code compliance pathway, an additional input opens for an exempt window up to 15 sq. ft. in rough opening area.  If the allowable area is exceeded, an error message is displayed.  The total area and UA value in this section does not include the exempt window.  On the other hand, the exempt window is included in the Heating System Sizing calculation below so it is considered in the sizing of the heating equipment."]
[]
[null,"Flat/Vaulted Ceilings"]
[null,"Up to 4 construction types for flat or vaulted ceilings can be entered.  Select a description of the component from the drop down -- OR click the button Go to Custom Input to enter a description and U-value for a custom construction  on the database tab Flat-Vaulted Ceilings.  Enter an area and optionally a Plan ID.  Custom U-values should be calculated in accordance with WSEC Appendix A."]
[]
[null,"Walls (Above Grade)"]
[null,"Up to 4 construction types for above-grade exterior walls or walls separating a conditioned space from an unconditioned space, such an unheated garage.  Select a description of the component from the drop down or click the button Go to Custom Input to enter a description and U-value for a custom construction on the database tab Walls (above grade).  Enter an area and optionally a Plan ID.  Custom U-values must be calculated in accordance with WSEC Appendix A.  For more, refer to the FAQ \"U-Factors for Non-Prescriptive Constructions\" available on our website at: "]
[null,null,"https://www.energy.wsu.edu/BuildingEfficiency/EnergyCode/AdditionalResources.aspx#FAQs"]
[]
[null,"Floor (over crawl or exterior)"]
[null,"Enter up to 4 construction types for floors over vented crawl spaces, cantilevered floors or floors over an unconditioned space, such as an unheated basement or garage.  Select a description of the component from the drop down or click the button Go to Custom Input to enter a description and U-value for a custom construction on the database tab Floors.  Enter an area and optionally a Plan ID.  Custom U-values must be calculated in accordance with WSEC Appendix A."]
[]
[null,"Slab on Grade (less than 2 feet below grade)"]
[null,"Enter up to 4 construction types for slab on grade foundations.  Select a description of the component from the drop down or click the button Go to Custom Input to enter a description and F-value for a custom construction on the database tab Slab on Grade.  Enter an exterior perimeter and optionally a Plan ID."]
[null,"A Slab-on-Grade Floor is defined as \"that portion of a slab floor of the building envelope that is in contact with the ground and that is either above grade or is less than or equal to 24 inches below the final elevation of the nearest exterior grade.\"  The \"nearest exterior grade\" is where grade meets the footing."]
[null,"By the definition of thermal envelope, the exterior perimeter includes the perimeter separating a conditioned space and an adjacent unconditioned space, such as an attached unheated garage."]
[null,"For more information on slabs, refer to the FAQ title \"“Slabs and Below-Grade Walls: Prescriptive Path” available on our website at: "]
[null,null,"https://www.energy.wsu.edu/BuildingEfficiency/EnergyCode/AdditionalResources.aspx#FAQs"]
[null,""]
[null,"Below Grade Walls and Slabs"]
[null,"Enter up to 4 construction types for below grade walls and slabs.  Select a description of the component from the drop down.  Or click the button Go to Custom Input to enter a description, slab F-value and wall U-value for a custom construction on the database tab Below Grade Walls & Slabs.  Optionally enter a Plan ID.  Below grade walls and slabs require both area and perimeter dimensions.  If you enter a custom construction, a unique description, U-value and a F-value are required."]
[null,"For more information, refer to the FAQ title \"“Slabs and Below-Grade Walls: Prescriptive Path” available on our website at: "]
[null,null,"https://www.energy.wsu.edu/BuildingEfficiency/EnergyCode/AdditionalResources.aspx#FAQs"]
[]
[null,"Heating System Sizing Worksheet"]
[null,"This section provides a preliminary estimate of the heating system size.  Note this calculator sizes heating systems only; it will not accurately size cooling systems.  This preliminary value should be used only a placeholder until submitting permit documents before an HVAC contractor provides a more accurate heating-cooling calculation that considers air conditioning and zones."]
[null,"Consider using ACCA Manual J and S or NEEA's SpecPro, instead of this worksheet, as approved by AHJ per R403.7 \"Equipment Sizing and Efficiency Rating\"."]
[null,"ACCA Manual J and S:",null,null,"https://www.acca.org/home"]
[null,"NEEA's SpecPro: ",null,null,"https://betterbuiltnw.com/resources/hvac-sizing-tool"]
[null,"Special Tip:  Early coordination with the HVAC contractor, the builder and the designer prior to submitting plans is critical to reduce the first cost of compliance with the code.  Coordination on the design and location of the thermal distribution air handler and ductwork may result in greater flexibility when considering HVAC options."]
[null,"Nearest Weather Station"]
[null,"Select the nearest weather station from the drop down menu.  Note only Washington weather stations are included on the menu."]
[null,"The tool uses this location to automatically look up the outdoor design temperature and determine the design temperature difference."]
[]
[null,"Conditioned Volume"]
[null,"Optionally enter the conditioned volume.  If you leave this cell blank an average ceiling height of 8.5 feet is assumed and the volume is calculated as the conditioned floor area multiplied by 8.5 feet.",null,null,null,null,null,null,null,null,"define ceiling height"]
[]
[null,"System Type"]
[null,"Select the system type as either Heat Pump or All Other Systems (not heat pump).  "]
[]
[null,"Location of Ducts"]
[null,"Indicate the location of ducts by selecting Unducted, Conditioned Space, or Unconditioned Space from the drop down menu."]
[]
[null,"Results of Heating System Sizing"]
[null,"The remainder of this section summarizes calculation results.  The final result is the Maximum Heat Equipment Output."]
[]
[null,"Database Tabs"]
[null,"Databases with insulation values for building constructions are located on white-colored tabs.  Each database includes a protected (unmodifiable section) at the top with an unprotected area for adding custom descriptions and insulation values at the bottom.  "]
[null,"The protected, unmodifable sections each includes a \"Most Frequently Used\" section where most common constructions are selected, followed by the complete database.  Construction descriptions and U-values generally correspond to constructions tabulated in WSEC Appendix A, available at:"]
[null,null,"2015 WSEC Appendices","http://www.energy.wsu.edu/Documents/ga_2015WSEC_Appx.pdf"]
[null,"To understand the construction descriptions, compare them to the corresponding tables in Appendix A.  "]
[null,"For example, compare this partial section of the database descriptions for above-grade wall constructions (in yellow on left) to Table A103.3.1(1) (on right):"]
[]
[]
[null,"Example Above-Grade Wall:  \"R11 cavity+R5 foam STD 2x4W Lap\" describes an above-grade wall with 2x4 standard-framed wood construction with lapped wood siding, having the cavity filled with R11 insulation and with R-5 foam board"]
[null,"Entering Custom Constructions and U-values"]
[null,"Only white areas on database tabs can be edited.   Enter component descriptions and calculated U-factors.  Submit the detailed calculations as part of the application for your building permit. "]
[null,"Where proposed construction assemblies are not represented in Appendix A tables, values shall be calculated in accordance with Chapters 21-29 in Standard RS-1 listed in Chapter 5, (ASHRAE Handbook of Fundamentals) using the framing factors listed in Appendix A where applicable."]
[null,"Where proposed construction assemblies are not represented in Appendix A tables, values shall be calculated in accordance with Chapters 21-29 in Standard RS-1 listed in Chapter 5, (ASHRAE Handbook of Fundamentals) using the framing factors listed in Appendix A where applicable."]
[null,"For envelope assemblies containing metal framing, the U-factor shall be determined by one of the following methods:"]
[null,1,"Results of laboratory or field measurements."]
[null,2,"Standard RS-25, listed in Chapter 5, where the metal framing is bonded on one or both sides to a metal skin or covering."]
[null,3,"The zone method as provided in Chapter 24 of Standard RS-1, listed in Chapter 5."]
[null,4,"Results of parallel path correction factors for effective framing/cavity R-values as provided in TABLE A103.3.6.1(1) : Effective R-Values for Metal Framing and Cavity Only for metal stud walls and roof/ceilings."]
[]
[null,"Tips / Known Issues"]
[null,"* ","Print button does not work in pre-2016 versions of Excel "]
[null,null,"- Temporary Solution:  Print using the Excel Tool Bar:  File / Print"]
[null,null,"- We plan to fix this issue.  Stay tuned -- and thanks for your patience."]
[null,"* ","This tool is not compatible with Excel for Mac"]
[null,null,"- Sorry, we do not have plans to develop a Mac compatible tool."]
[]
[null,"This tool is compatible with Office 365  -- How to unblock macros"]
[null,"*","However, it will not work if you open the calculator within Microsoft Edge.  Save the file to your local drive."]
[null,"*","Enabling macros requires that you change the properties of the file to unblock macros.   Follow the instructions in the link that comes up when you try to open the file."]
[null,"*","Here is a screenshot of Microsoft's instructions for modifying the file properties."]

{"sheet":"Instructions","index":2,"n_rows":126,"n_cols":1,"rows_kept":126,"cut":false,"hidden":true,"merged":[]}
["Component Performance Worksheet (CPWorksheet) "]
[]
["These worksheets are designed to document the qualification of building designs by the component performance approach described in the 2015 and 2018 edition, Washington State Energy Code (WSEC)."]
[]
["These instructions do not attempt to teach the requirements of the WSEC.  If you need an overview of the Code, we recommend that you begin by looking at the resources contained on the WSU Energy Program website: www.energy.wsu.edu/code. "]
[]
["Resources on the website include:"]
["· Text of the WSEC"]
[]
["How to use the worksheets"]
[]
["This Excel workbook contains 15 worksheets:"]
["Copyright Worksheet"]
["These instructions"]
["The Component Performance Worksheet"]
["   Group R occupancies as defined by the IECC"]
["The Library Worksheets"]
["   Energy Credit Options (Table 406.2)"]
["   Vertical Glazing"]
["   Overhead Glazing"]
["   Doors"]
["   Ceilings, Attic"]
["   Ceilings, Vault"]
["   Walls (above grade)"]
["   Floors"]
["   Slab on Grade"]
["   Below Grade Walls & Slabs"]
["   Weather"]
[]
[]
[]
["The Library Worksheets"]
[]
["The library worksheets provided the default component u-factors from the WSEC.  These are the u-factors necessary to complete most projects."]
[]
["You can enter custom component descriptions to the library worksheets.  If you have tested u-factors for windows, skylights and doors, you will want to enter them into the library, since tested u-factors tend to be more favorable to design qualification than the default values."]
[]
["To add new components to the library worksheets"]
[]
["For most building components, it is important to utilize the component listings from the code.  The exception is glazing and door products.  Most glazing products perform much better than the default code values.  If you can obtain NFRC certified u-factors for windows and doors, it is to your advantage to use them."]
[]
["To add data to the library: "]
["· Tab to the  library worksheet you would like to edit.  A blue box at the right of the screen has \n   instructions for editing the specific worksheet.  Each has somewhat different instructions.  "]
["· There are two types of cells in the worksheet.  White cells are for data entry; shaded cells perform calculations or summarize data.  Do not attempt to enter data into the shaded cells.  Do not delete rows, columns or cells.  This will disrupt the indexing reference to the CPWorksheet."]
["· Get in the habit of clearing cell contents using the delete key.  Other editing functions may leave traces \n   of entries or functions that are undesirable."]
["· Don’t forget to save your worksheet after you make changes."]
[]
["Note: The component library worksheets provide the default component u-factors from the WSEC.  These are the u-factors necessary to complete most projects.  Each of the worksheets contains space for users to input custom components as needed.\n\nPrevious versions of this workbook required opening a separate workbook containing the component libraries (CPLibrary.xls.)  This current version consolidates these two workbooks into one.  If you have been maintaining your own custom library entries, you will need to copy the custom entries from your original CPLibrary worksheet into the appropriate tab of this worksheet (do not copy the entire worksheets from the original CPLibrary worksheet – these entries will not be recognized by the component performance worksheets.  We strongly advise that you keep your original CPLibrary worksheet as a backup.\n"]
[]
["Gathering the Building Component Data"]
[]
["To document energy code compliance, you need to gather certain preliminary information.  You will need to identify all the different exterior components and measure them, based on the set of plans."]
[]
["Identify the Building Components"]
[]
["First, identify the building's thermal envelope.  This is the part of the building that separates the heated and unheated spaces.  Each different component of the building's thermal envelope should be clearly shown on the plans.  Read the component descriptions in the WSEC.  Match the construction method utilized in the project with the proper code description of the component."]
[]
["Measure the Building Components"]
[]
["Each component must be measured and the size of each noted.  Record all measurements.  List the measurements next to the component description."]
[]
["The following measurement conventions should be followed:"]
["· Most components are listed in terms of area in square feet (ft²).  Slabs are measured by the linear foot \n   (ft), based on the length of the conditioned slab perimeter."]
["· Use the rough opening area for windows and doors."]
[]
["You may want to print out a blank copy of the Component Performance CPWorksheet.  Keep notes on the sheet as you take measurements from the plans."]
[]
["Working with the CPWorksheet"]
[" "]
["Open the Worksheet"]
[]
["Immediately save the workbook under a new file name using the Save As function.  Give it a name specific to the project you are currently working on."]
[]
["The worksheets provide detailed documentation for the plans examiner and inspector.  Do not skimp on details.  Provide reference to the plans on the CPWorksheet using the “Plan ID” cell.  Provide itemized glazing and door schedules, as well as area inputs on other building components."]
[]
["The top of the worksheet asks for general data on the building and includes a summary of the data entry performed in the rest of the worksheet."]
[]
["The Proposed Design Values at the top of the worksheet are a summary of the data entered on the rest of the worksheet, and perform the calculation required by WSEC R402.1.4 Total UA alternative. "]
[]
["The Code Target Values on the top of the worksheet perform the calculations as prescribed in the WSEC R402.1.4 Total UA alternative. "]
[]
["Below the Proposed Design Values and the Code Target Values are the Target UA Total, and the Proposed UA Total.  To document compliance with the WSEC, the Proposed UA Total must be less than or equal to the Target UA Total.  In addition, you must select at least Energy Credit options, listed at the bottom of the worksheet, for a total of at least 1.5 credits to meet minimum WSEC requirements for a small dwelling unit, 3.5 credits for a medium dwelling unit, and 4.5 credits for large dwelling unit. The CPWorksheet will add the note “Qualifies” next to the Target and Proposed UA totals and Energy Credits, when these requirements are met.  You can not trade surplus Energy Credits for minimum envelope requirements."]
[]
["As you page down, you will find blank schedules for each component of the building.  This is where most of the data entry work is completed.  For each component, complete as many rows as needed to document your project."]
[]
["You only need to fill in cells that apply to your project.  The CPWorksheets have been developed to accommodate fairly complex structures with numerous building components.  Most projects will only utilize a fraction of the open cells on the CPWorksheet.  For example, most residential structures only use one above grade wall type.  In this case, only complete one row on the in the Walls (Above Grade) schedule; the other three rows would remain blank."]
[]
["A complete schedule for glazing and doors is required.  Plans examiners need to be able to compare the CPWorksheet entries to the plans and to the completed structure.  For each glazing or door model and size, a row on the schedule should be completed."]
[]
["Data Entry"]
[]
["There are two types of cells in the CPWorksheet.  Yellow cells are for data entry; shaded cells perform calculations or summarize data.  Do not attempt to enter data into the shaded cells."]
[]
["The worksheet includes tips on data entry.  Cells with tips can be identified by a red flag in the upper right corner of the cell.  To view comments one at a time, simply place the cursor over the flag.  A text box will appear with a tip on the specific cell."]
[]
["To view all the cell comments, go to the Excel menu bar, select View, then Comments. This will open all of the text boxes.  To close the comments, repeat the selection,  View, comments.  This provides a good overview for first time users.  If you need additional help viewing comments, use the Excel help menu."]
[" "]
["Help? "]
[]
["WSU Energy Program will provide limited direct support for this product.  Due to limited funding, it is simply not possible to complete forms for the public."]
[]
["WSU Energy Program does encourage e-mail input on this product.  Comments from users will be used to update the worksheets and improve these instructions.  Send your comments to energycode@energy.wsu.edu"]
[]
["Changes and Updates"]
[]
[]
["The copyright page includes a version number of the workbook.  If a change is required, a new version of the worksheets will be posted on our web page.  Check the web site periodically to assure you are using the most recent version."]
["Cheating"]
[]
["These worksheets contain password protected cells that should not be edited.  Plans examiners should be aware that this is not a 100% foolproof method of preventing tampering with the worksheets by unethical users; review submissions carefully. Editing cells in protected areas is a violation of the WSU Energy Program Copyright. "]
[" "]
["Copyright Restrictions"]
[]
["Copyright: Washington State University Extension Energy Program*"]
["© 2020"]
[]
["*WSUEEP grants limited, conditional permission to Designated Users for: "]
["1. Creation and distribution of free copies of the Spreadsheets and Workbooks, including electronic \n    reproduction;"]
["2. Editing of unprotected cells; and"]
["3. Printing results from the Workbooks;"]
[]
["The condition for permission is that the source of any materials copied or used from the Spreadsheets or Workbooks shall be acknowledged as: \"Copied by permission from Washington State University Extension Energy Program.\""]
[]
["No other use or purpose for copying is permitted including, without limitation, changing password protected cells in the Workbooks or selling or using the Spreadsheets and Workbooks in any way calculated to derive profit as a product or service. Report any violations of this Copyright Policy to: energycode@energy.wsu.edu."]
[]
["All other rights reserved."]

{"sheet":"Unblocking Macros","index":3,"n_rows":16,"n_cols":10,"rows_kept":16,"cut":false,"hidden":false,"merged":[[2,2,2,6],[2,7,2,11],[12,2,12,7],[13,2,13,7],[9,1,9,6],[11,1,11,6],[7,1,7,7],[8,1,8,7],[14,2,14,7],[15,2,15,7],[16,2,16,7],[4,1,4,6],[3,2,3,7],[6,1,6,8],[5,1,5,6]]}
[null,null,{"$f":"'Getting Started'!C1","v":"WSU Code Compliance Calculator  - WSEC 2018 & 2021"},null,null,null,null,null,null,"(C) 2024"]
[null,null,{"$f":"'Getting Started'!C2","v":"Washington State University  Energy Program "},null,null,null,null,null,null,{"$f":"VersionDate","v":"2026-06-10T18:45:04"}]
[null,null,{"$f":"'Getting Started'!C3","v":"For assistance contact: energycode@energy.wsu.edu"}]
[null,null,{"$f":"IF('Getting Started'!C178=\"\",\"\",'Getting Started'!C178)","v":""}]
[null,"This tool is compatible with Office 365 "]
[null,"This tool is compatible with Office 365.  However, it will not work if you open the calculator within Microsoft Edge.  Save the file to your local drive. "]
[null,"You also need to unblock macros, which Microsoft has made more more difficult in Office 365. "]
[null,"There are two methods to unblock macros.  We recommend you add a trusted Windows Explorer folder within Excel.  Then if you open an Excel worksheet that you have saved to a trusted folder, it will automatically open with macros enabled.  You only need to do this once, so it is the easiest method to follow.   It is very important if you do this that you you only save files you trust to your trusted location. "]
[null,"A second method is to change the properties of each file to unblock their macros.  This is more tedious because you have to do it every time you download a new version. "]
[null,"Adding a trusted Windows Explorer folder"]
[]
[null,"Modifying the properties of a file to unblock macros"]
[null,"*","Here is a screenshot of Microsoft's instructions for modifying the file properties."]
[null,null,{"$f":"IF('Getting Started'!C183=\"\",\"\",'Getting Started'!C183)","v":""}]
[null,null,{"$f":"IF('Getting Started'!C184=\"\",\"\",'Getting Started'!C184)","v":""}]
[null,null,{"$f":"IF('Getting Started'!C185=\"\",\"\",'Getting Started'!C185)","v":""}]

{"sheet":"Copyright","index":4,"n_rows":103,"n_cols":8,"rows_kept":103,"cut":false,"hidden":false,"merged":[[1,6,1,12],[2,6,3,11]]}
[null,{"$f":"Initializing!C1","v":"WSU Code Compliance Calculator  - WSEC 2018 & 2021"},null,null,null,null,"ENABLE MACROS: Macros must be enabled for this tool to function properly."]
[null,"Version: WSU_C32021_20260610a~Master.xlsm, 6/10/2026 6:45:04 PM",null,null,null,null,"Office 365 Users:  Save this file to your LOCAL drive."]
[null,"Tool Revision Date:","2026-06-10T18:45:04",null,null,null,"Calculator tabs will open after macros are enabled and terms of use are accepted."]
[null,"Your Excel Version: ",2019]
[]
[]
[]
[]
[]
[]
[]
[]
[]
[]
[]
[]
[]
[]
[]
[]
[]
[]
[]
[]
[]
[]
[]
[]
[]
[]
[]
[]
[]
[]
[]
[]
[]
[]
[]
[]
[]
[]
[]
[]
[]
[]
[]
[]
[]
[]
[]
[]
[]
[]
[]
[]
[]
[]
[]
[]
[]
[]
[]
[]
[]
[]
[]
[]
[]
[]
[]
[]
[null,null,"SheetProtection","Protected"]
[null,null,"SheetsUnhidden","Calculation Sheets Hidden"]
[null,null,"Mask",371753209829]
[]
[null,null,"Current IP Address","2607:fa78:118e:1:a0b2:cef6:7d6d:26a"]
[null,null,"Registered IP Address"]
[]
[]
[null,null,"First Name","Carolyn"]
[null,null,"Last Name","Roos"]
[null,null,"Registration Date:","2020-08-21"]
[null,null,"Version","Version: 2015-2018 Total UA Alternative Worksheet~20200819~C2200-1.xlsm, 8/19/2020 3:11:38 PM",null,null,null,"vb"]
[null,null,"Company","WSUEP"]
[null,null,"Demographic"]
[null,null,"ContactInfo1"]
[null,null,"ContactInfo2"]
[null,null,"ContactInfo3"]
[null,null,"ContactInfo4"]
[null,null,"City","Olympia"]
[null,null,"State"]
[null,null,"Zipcode"]
[null,null,"Add to Mailing List?","No"]
[null,null,"Registrations with this file",0]
[]
[]
[]
[]
[]
[]
[]
[null,null,"End of calculation area"]

{"sheet":"Group R","index":5,"n_rows":944,"n_cols":97,"rows_kept":944,"cut":false,"hidden":true,"merged":[[46,2,46,3],[47,2,47,3],[29,10,29,11],[35,10,35,11],[51,9,51,10],[50,11,50,15],[52,9,52,10],[50,4,50,6],[46,7,46,10],[50,9,50,10],[52,7,52,8],[46,11,46,12],[45,3,45,13],[47,11,47,12],[47,7,47,10],[49,3,49,13],[46,13,46,14],[50,7,50,8],[51,7,51,8],[51,11,51,15],[52,11,52,15],[50,2,50,3],[52,2,52,3],[52,4,52,6],[282,5,282,8],[1,12,1,13],[1,14,1,15],[30,10,30,11],[31,10,31,11],[32,10,32,11],[33,10,33,11],[34,10,34,11],[36,10,36,11],[26,10,26,13],[16,5,16,11],[27,10,27,11],[26,5,26,7],[17,5,17,8],[18,5,18,8],[19,5,19,8],[28,10,28,11],[55,7,55,8],[47,13,47,14],[46,4,46,6],[47,4,47,6],[53,4,53,6],[54,7,54,8],[272,5,272,8],[101,28,102,28],[170,28,171,28],[56,7,56,8],[58,7,58,8],[57,7,57,8],[60,7,60,8],[57,9,57,10],[60,9,60,10],[101,25,101,26],[101,27,102,27],[59,7,59,8],[89,28,90,28],[170,27,171,27],[101,13,102,13],[101,22,102,22],[101,23,101,24],[59,11,59,15],[60,11,60,15],[67,20,67,27],[170,13,171,13],[208,27,209,27],[55,4,55,6],[222,25,222,26],[220,10,220,11],[223,25,223,26],[219,27,220,27],[101,20,102,20],[170,20,171,20],[71,23,71,24],[71,25,71,26],[84,22,84,26],[89,20,90,20],[89,22,90,22],[89,23,89,24],[89,25,89,26],[96,22,96,26],[89,27,90,27],[181,27,182,27],[191,22,191,26],[197,27,198,27],[176,22,176,26],[203,22,203,26],[214,22,214,26],[170,12,171,12],[258,3,258,5],[259,3,259,5],[260,3,260,5],[255,6,255,9],[270,1,270,4],[181,12,182,12],[197,12,198,12],[191,7,191,11],[265,3,265,5],[231,6,231,7],[203,7,203,11],[246,5,246,6],[257,3,257,5],[245,5,245,6],[251,1,251,4],[240,1,240,4],[230,6,230,7],[208,12,209,12],[283,20,283,23],[224,10,224,11],[221,10,221,11],[222,10,222,11],[223,10,223,11],[219,10,219,11],[282,20,282,23],[224,25,224,26],[219,25,219,26],[220,25,220,26],[221,25,221,26],[219,12,220,12],[229,9,229,15],[51,4,51,6],[53,2,53,3],[264,3,264,5],[253,6,253,9],[214,7,214,11],[60,2,60,3],[60,4,60,6],[62,8,62,15],[51,2,51,3],[53,7,53,8],[54,2,54,3],[176,7,176,11],[59,2,59,3],[58,9,58,10],[56,4,56,6],[58,4,58,6],[57,4,57,6],[56,2,56,3],[58,2,58,3],[57,2,57,3],[55,2,55,3],[170,5,171,5],[54,4,54,6],[54,9,54,10],[54,11,54,15],[61,2,61,3],[101,5,102,5],[89,5,90,5],[89,10,89,11],[67,4,67,6],[67,7,67,14],[71,10,71,11],[101,12,102,12],[89,8,89,9],[101,7,102,7],[96,7,96,11],[89,7,90,7],[89,13,90,13],[89,12,90,12],[101,10,101,11],[61,9,61,10],[101,8,101,9],[14,6,14,15],[681,15,681,16],[71,8,71,9],[252,8,252,14],[254,6,254,9],[271,8,271,14],[53,11,53,15],[55,11,55,15],[56,11,56,15],[53,9,53,10],[56,9,56,10],[58,11,58,15],[55,9,55,10],[57,11,57,15],[59,9,59,10],[229,6,229,7],[235,6,235,7],[233,6,233,7],[234,6,234,7],[236,6,236,7],[680,11,680,12],[680,13,680,14],[681,11,681,12],[681,13,681,14]]}
[null,null,null,{"$f":"IF(MacroMessage=\"\",\"\",MacroMessage)","v":"ENABLE MACROS: Macros must be enabled for this tool to function properly."},null,null,null,null,null,null,null,null,null,null,null,null,null,null,{"$f":"IFERROR(CONCATENATE(\"UA Red=\",ROUND(N43,1),\"  (\",ROUND(N42*100,1),\"%)\"),\"--\")","v":"UA Red=39.8  (14.5%)"},null,null,null,null,null,null,null,null,null,null,null,null,null,null,null,null,null,"Prototypes"]
[null,null,{"$f":"'Getting Started'!$C$1","v":"WSU Code Compliance Calculator  - WSEC 2018 & 2021"},null,null,null,null,null,null,null,null,null,"Inputs",null,"Results",null,null,null,null,null,null,null,null,null,null,null,null,null,null,null,null,null,null,null,null,null,"id_prototypes","prototype","Tons","Furnsize","SDloc","SDArea","RDloc","RDArea","Afloorcon","Volume","Afloorext","Aextwall","Aceiling","AwinN","AwinE","AwinS","AwinW","Adoor","Foundtype","Afootprint","Pfootprint","HeightAG","HeightBG","StackHeight","FanCFM","achattic","achcrawl","WH","WH_size","HPWH_performance","ducted","WH_fan","WH_loc","InteractionFactor","prototype_desc","btype","occupants_per_unit","occupants","numunits","height_per_floor","floors_per_building","total_height","baseductsinside","bedrooms_per_unit","reqvent","glazing_pct_hfa","perim_width","perim_length","seemtemplate_sort","official_rtf_prototype","sqft_per_unit","sizecat","fan_cfm_per_unit","wh_size_per_unit","floor_ins_area","wall_ins_area","bsmtwall_ins_area","window_area","slab_area","wall_to_floor_area","duct_area"]
[null,null,null,null,null,null,null,null,null,null,null,null,null,null,null,null,null,null,null,null,null,null,null,null,null,null,null,null,null,null,null,null,null,null,null,null,1,"c1344",2.5,17.584272626562804,"Crawl",240,"Attic",50,1344,10752,0,1184,1344,43.68,43.68,43.68,43.68,40,1,1344,148,1,2,8,50,4.5,4.5,1,50,4,0,0,1,0.65,"sf home","sf",2.3918495297805644,2.3918495297805644,1,8,1,8,false,3,70.319999999999993,0.13,32,42,1,true,1344,1500,50,50,1344,969.28,0,174.72,0,0.88095238095238093,290]
[null,null,"Project Information",null,null,null,"Messages / Comments *",null,null,{"$f":"IF(Menu_UseOfCalculator=MenuItem_UserDefinedBaseline,\"\",\"RESULT=\")","v":"RESULT="},{"$f":"IFERROR(IF(Menu_UseOfCalculator=MenuItem_UserDefinedBaseline,\"\",J343),\"\")","v":"PASS"},null,null,null,null,null,null,null,"User Work Area",null,null,null,null,null,null,null,null,null,null,null,null,null,null,null,null,null,2,"s1344",2.5,17.584272626562804,"Attic",240,"Attic",50,1344,10752,0,1184,1344,43.68,43.68,43.68,43.68,40,2,1344,148,0,0,8,50,4.5,4.5,1,50,4,0,0,1,0.65,"sf home","sf",2.3918495297805644,2.3918495297805644,1,8,1,8,false,3,70.319999999999993,0.13,32,42,1,true,1344,1500,50,50,0,969.28,0,174.72,1344,0.88095238095238093,290]
[null,null,null,"2100 sq. ft. single family medium dwelling unit",null,null,{"$f":"IF(AND(K4=\"Pass\",Menu_UseOfCalculator=Item_Use_CompleteForms),\"Credit requirements are met\",IF(Menu_UseOfCalculator=MenuItem_NonDwellingUnit,\"-\",IF(OR(AND(H39>0,N39>0,H66>0),Menu_UseOfCalculator=Item_Use_CompleteForms),IF(N40<H40,\"Credit requirements are not met.  Select energy credits from Tables 406.2 and 406.3 below\",\"\"),\"\")))","v":""},null,null,null,null,null,null,null,null,null,null,null,null,null,null,null,null,null,null,null,null,null,null,null,null,null,null,null,null,null,3,"c2200",4,23.445696835417071,"Crawl",300,"Attic",80,2200,18700,200,2210,1784,91.300000000000011,91.300000000000011,91.300000000000011,91.300000000000011,40,1,1584,160,1,2,17,50,4.5,4.5,1,50,4,0,0,1,0.65,"sf home","sf",2.7944162436548226,2.7944162436548226,1,8.5,2,17,false,4,103.5,0.16600000000000001,36,44,2,true,2200,5000,50,50,1784,1804.8,0,365.20000000000005,0,1.0045454545454546,380]
[null,null,null,null,null,null,{"$f":"IF(Menu_UseOfCalculator<>Item_Use_CompleteForms,G364,\"\")","v":""},null,null,null,null,null,null,null,null,null,null,null,null,null,null,null,null,null,null,null,null,null,null,null,null,null,null,null,null,null,4,"s2200",4,23.445696835417071,"Attic",300,"Attic",80,2200,18700,200,2210,1784,91.300000000000011,91.300000000000011,91.300000000000011,91.300000000000011,40,2,1584,160,0,0,17,50,4.5,4.5,1,50,4,0,0,1,0.65,"sf home","sf",2.7944162436548226,2.7944162436548226,1,8.5,2,17,false,4,103.5,0.16600000000000001,36,44,2,true,2200,5000,50,50,200,1804.8,0,365.20000000000005,1584,1.0045454545454546,380]
[null,null,null,null,null,null,{"$f":"IF(Menu_UseOfCalculator=Item_Use_CompleteForms,\"\",IFERROR(IF(J18<>\"\",\"\",CONCATENATE(I335,I334)),\"\"))","v":"UA Reduction = 39.78, Proposed UA is better than baseline by 15%"},null,null,null,null,null,null,null,null,null,null,null,null,null,null,null,null,null,null,null,null,null,null,null,null,null,null,null,null,null,5,"b2688",3.5,17.584272626562804,"In",0,"Attic",40,2688,22848,0,1480,1344,94.080000000000013,94.080000000000013,94.080000000000013,94.080000000000013,40,4,1344,148,0.5,6.5,10,50,4.5,4.5,1,50,4,0,0,4,0.65,"sf home","sf",2.946236559139785,2.946236559139785,1,10,2,20,false,4,118.14,0.14000000000000001,32,42,3,true,2688,5000,50,50,0,1063.6799999999998,1036,376.32000000000005,0,0.93601190476190477,40]
[null,null,null,null,null,null,{"$f":"IFERROR(IF(K29=\"\",\"\",IF(Menu_UseOfCalculator=MenuItem_UFactorPath,IF(SUM(J29:J36)>0,\"A U-factor exceeds maximum allowed by U-factor Path\",\"\"),\"\")),\"\")","v":""}]
[null,null,null,null,null,null,{"$f":"IF(AND(Menu_UseOfCalculator=MenuItem_UserDefinedBaseline,Menu_ProjectType=\"New Construction\"),\"Check:  User-Defined Baseline is not typically used for New Construction.  Log homes are an example of new construction requiring User Defined Baseline\",\"\")","v":""}]
[null,null,"Contact Information",null,null,null,{"$f":"IF(Menu_UseOfCalculator=MenuItem_NonDwellingUnit,\"No credits required for non-dwelling unit\",IF(SUM(AF18:AF20)>0,\"Correct input errors below\",IF(OR(Menu_Option1=\"\",Menu_Option1=\"Not Selected\"),\"\",IFERROR(IF(Menu_UseOfCalculator=MenuItem_UserDefinedBaseline,\"\",IF(Menu_UseOfCalculator<>Item_Use_CompleteForms,IF(G786=\"\",\"\",G786),\"\")),\"\"))))","v":" UA reduction meets percent target of selected Option 1.2"},null,null,null,null,null,null,null,null,null,null,null,null,null,null,null,null,null,null,null,null,null,null,null,null,null,null,null,null,null,6,"b5000",6,35.168545253125608,"In",0,"Attic",60,5000,40100,200,2788,1800,187.5,187.5,187.5,187.5,40,4,1600,164,0.5,6.5,17,50,4.5,4.5,1,50,4,0,0,4,0.65,"sf home","sf",3.9355662368310997,3.9355662368310997,1,10,3,30,false,4,187.5,0.15,32,50,null,false,5000,9999,50,50,200,1998,1148,750,0,0.78720000000000001,60]
[null,null,null,null,null,null,{"$f":"IF(OR(Menu_UseOfCalculator=Item_Use_CompleteForms,Menu_ProjectType=Item_ProjectType_RemodelAlteration),\"\",IF(AND(M31>0.15*H66,F377=\"Yes\"),\"Vertical glazing area of proposed design exceeds 15% of floor area. Baseline window area set to 15% of floor area\",CONCATENATE(\"Window area is \",ROUND(M31/H66*100,0),\"% of floor area\")))","v":"Window area is 6% of floor area"},null,null,null,null,null,null,null,null,null,null,null,null,null,null,null,null,null,null,null,null,null,null,null,null,null,null,null,null,null,7,"c2460",6,23.445696835417071,"In",280,"In",70,2460,20910,0,2193,820,92.25,92.25,92.25,92.25,60,1,821.5,86,1,2,25.5,150,4.5,4.5,1,150,4,0,0,1,0.65,"garden style","mf",2.25,6.75,3,8.5,3,25.5,true,2,141.29999999999998,0.15,26.5,31,null,false,820,1500,50,50,821.5,1764,0,369,0,0.89146341463414636,350]
[null,null,null,null,null,null,{"$f":"G908","v":" -"}]
[null,null,null,null,null,null,{"$f":"IF(Switch_ShowVentilationCalculator=\"Hide\",\"--\",IF(Menu_UseOfCalculator=Item_Use_CompleteForms,\"\",IF(F249<>\"Error\",IF(F249<>\"\",CONCATENATE(E249,\": \",F249,\" \",G249,\" with Run Time Percent of \",F245*100,\"%, \",F246, \", \",F247),\"\"),CONCATENATE(E249,\": incomplete ventilation inputs\"))))","v":"Whole House Mechanical Ventilation Airflow Rate: 68.75 CFM with Run Time Percent of 100%, Balanced, Not Distributed"},null,null,null,null,null,null,null,null,null,null,null,null,null,null,null,null,null,null,null,null,null,null,null,null,null,null,null,null,null,"vvvvvvvv Not used in 2018 WSREC Analysis",null,null,null,null,null,null,null,"Not used in 2018 WSREC Analysis",null,null,null,"Not used in 2018 WSREC Analysis",null,null,null,"Not used in 2018 WSREC Analysis",null,null,null,"Not used in 2018 WSREC Analysis",null,null,null,"Not used in 2018 WSREC Analysis",null,null,null,"Not used in 2018 WSREC Analysis"]
[null,null,null,null,null,null,{"$f":"IF(Switch_ShowDistributionCalculator=\"Hide\",\"--\",IF(Menu_UseOfCalculator=Item_Use_CompleteForms,\"\",IF(Switch_DuctTestingRequired=\"Yes\",CONCATENATE(F268,\": \",ROUND(G268,0),\" \",H268),\"\")))","v":"Maximum allowable total measured duct leakage: 84 CFM25"},null,null,null,null,null,null,null,null,null,null,null,null,null,null,null,null,null,null,null,null,null,null,null,null,null,null,null,null,null,10,"c1500",6,35.168545253125608,"Crawl",100,"Attic",50,1500,14250,0,1259,500,48.75,48.75,48.75,48.75,40,1,500,90,1,2,28.5,50,4.5,4.5,1,50,4,0,0,1,0.65,"townhome","sf",1.69,1.69,1,9.5,3,28.5,false,3,75,0.13,20,25,4,true,1500,5000,50,50,500,1024,0,195,0,0.83933333333333338,150]
[null,null,null,null,null,null,"* Results assume your inputs are complete and correct.  Results do not constitute an approval.  Analysis should be reviewed by your AHJ.  ",null,null,null,null,null,null,null,null,null,null,null,null,null,null,null,null,null,null,null,null,null,null,null,null,null,null,null,null,null,{"$f":"AK14+1","v":11},"s1500",6,35.168545253125608,"Attic",20,"Attic",50,1500,14250,0,1259,500,48.75,48.75,48.75,48.75,40,2,500,90,0,0,28.5,50,4.5,4.5,1,50,4,0,0,1,0.65,"townhome","sf",1.69,1.69,1,9.5,3,28.5,false,3,75,0.13,20,25,5,true,1500,5000,50,50,0,1024,0,195,500,0.83933333333333338,70]
[null,null,"ANALYSIS SET UP",null,null,null,null,null,null,null,null,null,null,null,null,null,null,null,null,null,null,null,null,null,null,null,null,null,null,null,null,null,null,null,null,"Add view tables only",{"$f":"AK15+1","v":12},"s1000",6,35.168545253125608,"In",0,"In",0,26400,237600,0,10152,8800,990,990,990,990,84,2,8800,376,0,0,27,1200,4.5,4.5,1,1200,4,0,0,1,0.65,"double loaded corridor","mf",1.69,40.56,24,9,3,27,true,2,1332,0.15,88,100,6,true,1100,1500,50,50,0,6108,0,3960,8800,0.38454545454545452,0]
[null,null,null,null,"What code compliance pathway are you using?","Total UA Alternative, Whole Building Trade Off Analysis",null,null,null,null,null,null,{"$f":"IF(Menu_ProjectType=\"\",\"Error: Select from drop down\",(IF(AND(Menu_ProjectType=Item_ProjectType_RemodelAlteration,Menu_UseOfCalculator=MenuItem_UFactorPath),\"Error: For Remodels, select User-Defined Baseline.\",\"\")))","v":""},null,null,null,null,null,null,null,null,null,null,null,null,null,null,null,null,null,null,null,null,null,null,null,13,"c1904",4,17.584272626562804,"In",280,"In",70,1904,16184,0,1632,952,71.399999999999991,71.399999999999991,71.399999999999991,71.399999999999991,40,1,952,96,1,2,17,100,4.5,4.5,1,100,4,0,0,1,0.65,"garden style","mf",1.69,3.38,2,8.5,2,17,true,2,102.12,0.15,28,34,7,false,952,1500,50,50,952,1306.4000000000001,0,285.59999999999997,0,0.8571428571428571,350]
[null,null,null,null,"Project Building Type?","New Construction",null,null,null,{"$f":"IF(Menu_ProjectType=\"\",\"Error: Select from drop down\",(IF(AND(Menu_ProjectType=Item_ProjectType_RemodelAlteration,Menu_UseOfCalculator=MenuItem_UFactorPath),\"Or, select either New Construction or Addition with this compliance path.\",IF(AND(Menu_UseOfCalculator=MenuItem_UserDefinedBaseline,Menu_ProjectType<>Item_ProjectType_RemodelAlteration),\"Select Addition / Remodel / Alteration with this Path\",\"\"))))","v":""},null,null,null,null,null,null,null,null,null,null,null,null,null,null,null,null,null,null,null,null,null,{"$f":"IF(J18<>\"\",1,0)","v":0},null,null,null,null,14,"c2856",6,23.445696835417071,"In",280,"In",70,2856,24276,0,2448,952,107.1,107.1,107.1,107.1,60,1,952,96,1,2,25.5,150,4.5,4.5,1,150,4,0,0,1,0.65,"garden style","mf",1.69,5.07,3,8.5,3,25.5,true,2,153.18,0.15,28,34,7,false,952,1500,50,50,952,1959.6,0,428.4,0,0.8571428571428571,350]
[null,null,null,null,"Occupancy Type?","R3 Single family dwellings and townhouses",null,null,null,{"$f":"IF(ISERROR(VLOOKUP(F19,N400:N401,1,FALSE)),\"Error: Select option from drop down\",\"\")","v":""},null,null,null,null,null,null,null,null,null,null,null,null,null,null,null,null,null,null,null,null,null,{"$f":"IF(J19<>\"\",1,0)","v":0},null,null,null,null,15,"s1904",4,17.584272626562804,"In",280,"In",70,1904,16184,0,1632,952,71.399999999999991,71.399999999999991,71.399999999999991,71.399999999999991,40,2,952,96,0,0,17,100,4.5,4.5,1,100,4,0,0,1,0.65,"garden style","mf",1.69,3.38,2,8.5,2,17,true,2,102.12,0.15,28,34,7,false,952,1500,50,50,0,1306.4000000000001,0,285.59999999999997,952,0.8571428571428571,350]
[null,null,null,null,"Code Version?","WSEC 2021",null,null,null,{"$f":"IF(ISERROR(VLOOKUP(F20,K400:K401,1,FALSE)),\"Error: Select option from drop down\",\"\")","v":""},null,null,null,null,null,null,null,null,null,null,null,null,null,null,null,null,null,null,null,null,null,{"$f":"IF(Menu_CodeVersion=\"WSEC 2021\",0,IF(J20<>\"\",1,0))","v":0},null,null,null,null,16,"s2856",6,23.445696835417071,"In",280,"In",70,2856,24276,0,2448,952,107.1,107.1,107.1,107.1,60,2,952,96,0,0,25.5,150,4.5,4.5,1,150,4,0,0,1,0.65,"garden style","mf",1.69,5.07,3,8.5,3,25.5,true,2,153.18,0.15,28,34,7,false,952,1500,50,50,0,1959.6,0,428.4,952,0.8571428571428571,350]
[null,null,null,null,"Classification:",{"$f":"IF($H$66>0,CONCATENATE($F$400,\" -- \",ROUND(H66,0),\" sq. ft.\"),\"Enter floor area below to determine classification\")","v":"Medium Dwelling Unit -- 2100 sq. ft."},null,null,null,null,null,null,null,null,null,null,null,null,null,null,null,null,null,null,null,null,null,null,null,null,null,null,null,null,null,null,17,"s952",6,35.168545253125608,"In",280,"In",70,7616,64736,0,6528,3808,285.60000000000002,285.60000000000002,285.60000000000002,285.60000000000002,160,2,3808,328,0,0,17,400,4.5,4.5,1,400,4,0,0,1,0.65,"garden style","sf",1.69,13.52,8,8.5,2,17,true,2,408.48,0.15000000000000002,28,136,7,true,952,1500,50,50,0,5225.6000000000004,0,1142.4000000000001,3808,0.8571428571428571,350]
[null,null,null,null,"Baseline Description: ",{"$f":"IFERROR(IF(Menu_UseOfCalculator=MenuItem_NonDwellingUnit,\"U-factor Table\",IF(F629=0,\"\",CONCATENATE(F629,\" - \",VLOOKUP(Menu_UseOfCalculator,Table_UseOfCalculator,F326, FALSE)))),\"ERROR: Select from drop downs above\")","v":"Code Baseline - Maximum baseline window area is 15% of floor area."}]
[null,null,null,null,"About Your Selection:",{"$f":"IFERROR(VLOOKUP(Menu_UseOfCalculator,Table_UseOfCalculator,K326,FALSE),\"\")","v":"No exempt window or door areas"}]
[null,null,null,null,null,{"$f":"F404","v":"-"}]
[]
[null,null,"RESULTS - Comparison of Baseline and Proposed Design **"]
[null,null,null,null,"Component Performance, R occupancies","Baseline Design",null,null,null,null,"Proposed Design"]
[null,null,null,null,null,"U *","Area","UA",null,null,"U",null,"Area","UA",null,null,null,null,null,null,null,null,null,null,null,null,null,null,null,null,null,null,null,null,null,null,"drop down autoload of prototypes"]
[null,null,null,null,"Doors U =",{"$f":"IFERROR(HLOOKUP($F$629,Table_Uvalue_Options,U636,FALSE),\"\")","v":0.3},{"$f":"IFERROR(M653,\"\")","v":91.1111111111111},{"$f":"J616","v":27.333333333333329},null,{"$f":"IF(Menu_UseOfCalculator=MenuItem_UFactorPath,IF(O29<>\"\",1,0),\"\")","v":""},{"$f":"IFERROR(N29/M29,\"\")","v":0.3},null,{"$f":"M85","v":91.1111111111111},{"$f":"N85","v":27.333333333333329},{"$f":"IFERROR(IF(K29=\"\",\"\",IF(Menu_UseOfCalculator=MenuItem_UFactorPath,IF(K29>F29,\"U-factor exceeds max allowed\",\"\"),\"\")),\"\")","v":""},null,null,null,null,null,null,null,null,null,null,null,null,null,null,null,null,null,null,null,null,null,"exempt doors for prescriptive method"]
[null,null,null,null,"Overhead Glazing U =",{"$f":"IFERROR(HLOOKUP($F$629,Table_Uvalue_Options,U637,FALSE),\"\")","v":0.5},{"$f":"IFERROR(M654,\"\")","v":0},0,null,"","",null,{"$f":"M97","v":0},{"$f":"N97","v":0},""]
[null,null,null,null,"Vertical Glazing U =",0.3,{"$f":"IFERROR(M655,\"Error\")","v":132.25},39.674999999999997,null,"",0.28000000000000003,null,{"$f":"M165","v":132.25},{"$f":"N165","v":37.03},""]
[null,null,null,null," Flat/Vaulted Ceilings U =",2.4E-2,{"$f":"IFERROR(M656,\"\")","v":1578},37.872,null,"",2.5000000000000001E-2,null,{"$f":"M177","v":1578},{"$f":"N177","v":39.450000000000003},"",null,null,null,null,null,null,null,null,null,null,null,null,null,null,null,null,null,null,null,null,null,"To do:"]
[null,null,null,null," Wall (above grade)  U =",5.6000000000000001E-2,{"$f":"IFERROR(M657,\"\")","v":2201.6800000000003},123.29408000000002,null,"",4.1999999999999996E-2,null,{"$f":"M192","v":2201.6800000000003},{"$f":"N192","v":92.470560000000006},"",null,null,null,null,null,null,null,null,null,null,null,null,null,null,null,null,null,null,null,null,null,"Hide calc areas "]
[null,null,null,null,"Floors over Crawlspace U =",2.9000000000000001E-2,1578,45.762,null,"",2.4E-2,null,{"$f":"M204","v":1578},{"$f":"N204","v":37.872},"",null,null,null,null,null,null,null,null,null,null,null,null,null,null,null,null,null,null,null,null,null,"Check unlocked areas"]
[null,null,null,null,"Slab on Grade F =",0.54,0,0,null,"","",null,{"$f":"M215","v":0},{"$f":"N215","v":0},"",null,null,null,null,null,null,null,null,null,null,null,null,null,null,null,null,null,null,null,null,null,"Update instructions"]
[null,null,null,null," Below Grade Wall U =","N/A",0,"",null,{"$f":"IF(Menu_UseOfCalculator=MenuItem_UFactorPath,IF(O36<>\"\",1,0),\"\")","v":""},"",null,{"$f":"I226","v":0},{"$f":"J226","v":0},{"$f":"IFERROR(IF(K36=\"\",\"\",IF(Menu_UseOfCalculator=MenuItem_UFactorPath,IF(O37>I37,\"Effective F-factor exceeds max allowed\",\"\"),\"\")),\"\")","v":""},null,null,null,null,null,null,null,null,null,null,null,null,null,null,null,null,null,null,null,null,null,"Option 1 percentage baseline - Message in message area"]
[null,null,null,null," Below Grade Slab  F =","N/A",0,"",{"$f":"IFERROR(IF(F36=\"N/A\",\"\",(F36*G36+F37*G37)/G37),\"\")","v":""},{"$f":"IF(OR(F36=\"N/A\",F36=0),\"\",\"=eff F max\")","v":""},"",null,{"$f":"M226","v":0},{"$f":"N226","v":0},{"$f":"IFERROR(IF(F36=\"N/A\",\"\",I228),\"\")","v":""},{"$f":"IFERROR(IF(OR(F36=\"N/A\",M37=0),\"\",\"=eff F of below grade wall and slab\"),\"\")","v":""},null,null,null,null,null,null,null,null,null,null,null,null,null,null,null,null,null,null,null,null,"Ctrl-Z doesn't work"]
[null,null,null,null,null,{"$f":"IF(Menu_UseOfCalculator=MenuItem_UserDefinedBaseline,\"* Values from user-defined baseline\",IF(Menu_CodeVersion=K400,\"* Values from Table R402.1.2 (Oct 2023)\",\"* Values from Table R402.1.3\"))","v":"* Values from Table R402.1.2 (Oct 2023)"},null,null,null,null,null,null,null,null,null,null,null,null,null,null,null,null,null,null,null,null,null,null,null,null,null,null,null,null,null,null,"WSU logo - formatting"]
[null,null,null,null,null,null,"Baseline UA Total",{"$f":"IF(SUBTOTAL(109,O75:O226)=0,SUM(H29:H37),\"Check Missing Inputs or Errors\")","v":273.93641333333335},null,null,null,null,"Proposed UA Total",{"$f":"IF(SUBTOTAL(109,O75:O226)=0,SUM(N29:N37),\"Check Missing Inputs or Errors\")","v":234.15589333333332},null,null,null,null,null,null,null,null,null,null,null,null,null,null,null,null,null,null,null,null,null,null,"Change password"]
[null,null,null,null,null,null,"Required Credits",{"$f":"IFERROR(IF(Menu_UseOfCalculator=MenuItem_UserDefinedBaseline,H41,IF(Menu_UseOfCalculator=MenuItem_NonDwellingUnit,\"None\",F403)),\"Select occupancy type\")","v":8},null,null,null,null,"Proposed Credits ",{"$f":"IF(Menu_UseOfCalculator=MenuItem_NonDwellingUnit,\"NA\",P682)","v":8},{"$f":"IF(Menu_CodeVersion=\"WSEC 2015\",\"from Table 406.2\",\"from Tables 406.2 and 406.3\")","v":"from Tables 406.2 and 406.3"},null,null,null,null,null,null,null,null,null,null,null,null,null,null,null,null,null,null,null,null,null,"Baylon Review:  For 2018, Appendices were not updated"]
[null,null,null,null,null,null,"Required Credits",0,{"$f":"IF(AND(Menu_UseOfCalculator=MenuItem_UserDefinedBaseline,RequiredCredits_UserDefined=\"\"),\"Error: Enter required credits\",\"\")","v":""},null,null,null,"Proposed Credits ",{"$f":"N40","v":8}]
[null,null,null,null,null,null,null,null,null,null,null,null,"UA Percent Reduction",{"$f":"IFERROR(IF(AND(Menu_UseOfCalculator=MenuItem_UserDefinedBaseline,Menu_ProjectType<>\"New Construction\"),\"Calculate %UA reduction based on Addition UA\",IF(H39+N39=0,\"\",IFERROR((H39-N39)/H39,\"Check Errors\"))),\"\")","v":0.14521808004981795},null,null,null,null,null,null,null,null,null,null,null,null,null,null,null,null,null,null,null,null,null,null,"Baylon: Still need U and F for R20 perimeter +R20 underslab for below-grade slabs - Estimated as R20 perimeter + R10 underslab"]
[null,null,null,null,null,null,null,null,null,null,null,null,"UA Reduction",{"$f":"IFERROR(H39-N39,\"\")","v":39.780520000000024},null,null,null,null,null,null,null,null,null,null,null,null,null,null,null,null,null,null,null,null,null,null,"User registration"]
[null,null,null,{"$f":"IF(Menu_UseOfCalculator=E329,\"If the Proposed UA ≤ the Target UA, and the Proposed Credits from Table 406 are ≥ those required in Section R406, then the home meets the WSEC.\",\"\")","v":""}]
[null,null,"** Results assume your inputs are complete and correct.  Results do not constitute an approval.  Analysis should be reviewed by your AHJ.  ",null,null,null,null,null,null,null,null,null,null,null,null,null,null,null,null,null,null,null,null,null,null,null,null,null,null,null,null,null,null,null,null,null,"Exception R502.1.1 requires calculation of UA of existing building"]
[null,null,null,{"$f":"IF(Menu_CodeVersion=\"WSEC 2018\",\"Table R406.2 Fuel Normalization Credits\",\"Table R406.2 Energy Equalization Credits\")","v":"Table R406.2 Energy Equalization Credits"}]
[null,null,"System No.",null,"Full Description",null,null,"Select System Type",null,null,null,"Fuel Normalization Credits (406.2)",null,"Energy Credits (406.3)",null,"Total Credits (406.2 & 406.3)"]
[null,null,{"$f":"IFERROR(VLOOKUP(H48,Table_FuelNormalization,3,FALSE),\"\")","v":4},null,{"$f":"IFERROR(VLOOKUP(H48,Table_FuelNormalization,2,FALSE),\"Error: Reselect System Type\")","v":"For heating system using a heat pump that meets federal standards for the equipment listed in Table C403.3.2(2) or Table C403.3.2(9) OR Air to Water heat pump units that are configured to provide both heating and cooling and are rated in accordance with AHRI 550/590 "},null,null,"Variable Refrigerant Heat Pump or Air-to-Water Heat Pump",null,null,null,{"$f":"IFERROR(IF(Menu_CodeVersion=\"WSEC 2015\",0,VLOOKUP(H48,Table_FuelNormalization,H686,FALSE)),\"NA\")","v":3},null,{"$f":"J62","v":5},null,{"$f":"IF(ISNUMBER(L48)=TRUE,L48+J62,N48)","v":8}]
[]
[null,null,null,"Table R406.3 Energy Credits",null,null,null,null,null,null,null,null,null,null,null,null,null,null,null,null,null,null,null,null,null,null,null,null,null,null,null,null,null,null,null,null,"Remodel changes use"]
[null,null,"Option No.",null,"Category",null,null,"Select Options",null,"Energy Credits",null,"Brief Description of Selected Options*"]
[null,null,1,null,"Efficient Building Envelope",null,null,"Option 1.2",null,{"$f":"IFERROR(VLOOKUP(H52,Table_Option_1_Selected,2,FALSE),0)","v":1},null,{"$f":"IFERROR(VLOOKUP(H52,Table_Option_1_Selected,3,FALSE),\" \")","v":"Perscriptive compliance per Table 402.1.3 / U-0.25 vertical fenestration / R-38 floors or R-10 perimeter & fully insulated slab. Or 15% reduction in UA per section R402.1.5"},null,null,null,null,null,null,null,null,null,null,null,null,null,null,null,null,null,null,null,{"$f":"IFERROR(G787,\"\")","v":""},null,null,null,null,"Addition less than 500 sf not included in Target Credit calc"]
[null,null,2,null,"Air Leakage Control and Efficient Ventilation",null,null,"Option 2.1",null,{"$f":"IFERROR(VLOOKUP(H53,Table_Option_2_Selected,2,FALSE),0)","v":1},null,{"$f":"IFERROR(VLOOKUP(H53,Table_Option_2_Selected,3,FALSE),\" \")","v":"Per Section R402.4.1.2 / 2.0 ACH50 / For R-2, 0.25 cfm per ft2 at 50 Pa. /  HRV with min SHR eff of 0.65 per IRC Section M1505.3 or IMC Section 403.8"},null,null,null,null,null,null,null,null,null,null,null,null,null,null,null,null,null,null,null,null,null,null,null,null,"Unite forms into one"]
[null,null,{"$f":"IF(Menu_CodeVersion=\"WSEC 2021\",\"3.1 -3.10\",\"3\")","v":"3.1 -3.10"},null,"High Efficiency HVAC ",null,null,"Option 3.7",null,{"$f":"IFERROR(VLOOKUP(H54,Table_Option_3_Selected,2,FALSE),0)","v":2},null,{"$f":"IFERROR(IF(J54<>\"NA\",VLOOKUP(H54,Table_Option_3_Selected,3,FALSE),CONCATENATE(VLOOKUP(H54,Table_Option_3_Selected,3,FALSE),\" -- Not applicable to R2 Multifamily\")),\"\")","v":"Ductless Split System with no electric resistance in primary living areas.  HSPF2, of 9 (HSPF of 10), except HSPF2 of 8.1 (HSPF of 9) if heating load is 24000 BTUs or less."},null,null,null,null,null,null,null,null,null,null,null,null,null,null,null,null,null,null,null,{"$f":"IF(AND(MenuSelection_Option3<>\"Option 3.10\",Menu_CodeVersion=\"WSEC 2021\",MenuSelection_Option5=\"Option 5.8\"),\"Select Option 3.10 with Option 5.8\",\"\")","v":""},null,null,null,null,"1. Existing baseline  --> Add toggle"]
[null,null,3.11,null,"High Efficiency HVAC: Smart Thermostat",null,null,"Not Selected",null,{"$f":"IF(OR(MenuSelection_Option3=\"Option 3.1\",MenuSelection_Option3=\"Option 3.2\",MenuSelection_Option3=\"Not Selected\",MenuSelection_Option3=\"\"),IFERROR(VLOOKUP(H55,Table_Option_39_Selected,2,FALSE),0),\"NA\")","v":"NA"},null,{"$f":"IF(OR(H55=\"\",H55=\"Not Selected\"),\"\",IF(AND(J55=\"NA\",H55=\"Option 3.11\"),\"Option 3.11 can only be taken with Option 3.1 or 3.2\",IFERROR(IF(J55<>\"NA\",VLOOKUP(H55,Table_Option_39_Selected,3,FALSE),CONCATENATE(VLOOKUP(H55,Table_Option_3_Selected,3,FALSE),\" -- Not applicable to R2 Multifamily\")),\"\")))","v":""}]
[null,null,4,null,"High Efficiency HVAC Distribution System",null,null,null,null,{"$f":"IF(Menu_Option4=\"\",0,IF(Flag_IsDuctless=1,\"NA\",IFERROR(VLOOKUP(H56,Table_Option_4_Selected,2,FALSE),0)))","v":0},null,{"$f":"IFERROR(IF(J56<>\"NA\",VLOOKUP(H56,Table_Option_4_Selected,3,FALSE),CONCATENATE(VLOOKUP(H56,Table_Option_4_Selected,3,FALSE),\" - Not applicable to ductless system  selected in Option 3\")),\"\")","v":""},null,null,null,null,null,null,null,null,null,null,null,null,null,null,null,null,null,null,null,null,null,null,null,null,"2. Double counting energy credits"]
[null,null,{"$f":"IF(Menu_CodeVersion=\"WSEC 2015\",\"5a\",\"5.1\")","v":"5.1"},null,"Efficient Water Heating: Drain Heat Recovery",null,null,null,null,{"$f":"IFERROR(VLOOKUP(H57,Table_Option_51_Selected,2,FALSE),0)","v":0},null,{"$f":"IFERROR(VLOOKUP(H57,Table_Option_51_Selected,3,FALSE),\" \")","v":" "},null,null,null,null,null,null,null,null,null,null,null,null,null,null,null,null,null,null,null,null,null,null,null,null,"5.  Most frequently used section on all drop downs"]
[null,null,5.2,null,"Efficient Water Heating: Compact Hot Water Distribution ",null,null,null,null,{"$f":"IFERROR(VLOOKUP(H58,Table_Option_52_Selected,2,TRUE),0)","v":0},null,{"$f":"IFERROR(VLOOKUP(H58,Table_Option_52_Selected,3,TRUE),\" \")","v":" "}]
[null,null,{"$f":"IF(Menu_CodeVersion=\"WSEC 2021\",\"5.3-5.8\",\"5.2-5.6\")","v":"5.3-5.8"},null,"Efficient Water Heating",null,null,"Option 5.4",null,{"$f":"IFERROR(VLOOKUP(H59,Table_Option_5_Selected,2,FALSE),0)","v":1},null,{"$f":"IFERROR(VLOOKUP(H59,Table_Option_5_Selected,3,FALSE),\" \")","v":"Energy star gas or propane water heater with min UEF of 0.91 OR Solar supplemental water heating OR GSHP meeting requirements of Option 3.4"},null,null,null,null,{"$f":"IF(AND(MenuSelection_Option3=\"Option 3.10\",Menu_CodeVersion=\"WSEC 2021\",H59<>\"Option 5.8\"),\"Select Option 5.8 with Option 3.10\",\"\")","v":""},null,null,null,null,null,null,null,null,null,null,null,null,null,null,{"$f":"IF(Menu_UseOfCalculator=MenuItem_UserDefinedBaseline,\"---\",IF(AND(MenuSelection_Option3=\"Option 3.10\",Menu_CodeVersion=\"WSEC 2021\",H59<>\"Option 5.8\"),\"Select Option 5.8 with Option 3.10\",\"\"))","v":""},null,null,null,null,"Existing building as baseline"]
[null,null,6,null,"Renewable Electric Energy",3000,"kWh",null,null,{"$f":"IFERROR(VLOOKUP(H60,Table_Option_6_Selected,2,FALSE),0)","v":0},null,{"$f":"IF(OR(H60=\"Not Selected\",H60=\"\"),\"\",IFERROR(IF(AND(F60<>0,F60<>\" \"),VLOOKUP(H60,Table_Option_6_Selected,3,FALSE),\"Error: Enter annual electrical generation per housing unit in kWh\"),\"\"))","v":""},null,null,null,null,null,null,null,null,null,null,null,null,null,null,null,null,null,null,null,null,null,null,null,null,"Strip out blank rows in menus"]
[null,null,7,null,"Appliance Package",null,null,null,null,{"$f":"IFERROR(VLOOKUP(H61,Table_Option_7_Selected,2,FALSE),0)","v":0},null,{"$f":"IFERROR(VLOOKUP(H61,Table_Option_7_Selected,3,FALSE),\" \")","v":" "},null,null,null,null,null,null,null,null,null,null,null,null,null,null,null,null,null,null,null,null,null,null,null,null,"warnings about missing data if prescriptive path"]
[null,null,null,null,null,null,null,null,"Energy Credits",{"$f":"SUBTOTAL(109,J52:J61)","v":5},null,null,null,null,null,null,null,null,null,null,null,null,null,null,null,null,null,null,null,null,null,null,null,null,null,null,"warings about custom data"]
[null,null,null,null,{"$f":"IF(Menu_CodeVersion=K400,\"*Refer to WSEC 2021 Table R406.3 for complete option descriptions and requirements\",\"*Refer to WSEC 2018 Table R406.3 for complete option descriptions and requirements\")","v":"*Refer to WSEC 2021 Table R406.3 for complete option descriptions and requirements"},null,null,null,"https://sbcc.wa.gov/state-codes-regulations-guidelines/state-building-code/energy-code",null,null,null,null,null,null,null,null,null,null,null,null,null,null,null,null,null,null,null,null,null,null,null,null,null,null,null,"Update front matter - copyright"]
[]
[null,null,"THERMAL ENVELOPE DETAILS - Proposed Design",null,null,null,null,null,null,null,null,null,null,null,null,null,null,"THERMAL ENVELOPE DETAILS - Baseline Design"]
[null,null,null,null,null,null,{"$f":"IFERROR(CONCATENATE(Message_FloorArea,\", Proposed Design\"),\"Conditioned Floor Area, Proposed Design\")","v":"Conditioned Floor Area, Proposed Design"},2100,"sq. ft",null,null,null,null,null,null,null,null,null,null,"Conditioned Floor Area, Baseline Design",2216,"sq. ft"]
[null,null,null,null,null,null,"Classification",{"$f":"IF($H$66>0,$F$400,\"Enter floor area to determine classification\")","v":"Medium Dwelling Unit"}]
[null,null,null,null,"Notes",null,null,null,null,null,null,null,null,null,null,null,null,null,null,{"$f":"E68","v":"Notes"}]
[null,null,null,null,null,null,null,null,null,null,null,null,null,null,null,null,null,null,null,null,null,null,null,null,null,null,null,null,null,null,null,null,null,null,null,null,"Tier 2/3"]
[null,null,null,null,null,null,null,null,null,null,null,null,null,null,null,null,null,null,null,null,null,null,null,null,null,null,null,null,null,null,null,null,null,null,null,null,"correct message about window area"]
[null,null,null,"Exterior Doors",null,null,null,null,null,null,null,null,null,null,null,null,null,null,"Exterior Doors",null,null,null,null,null,null,null,null,null,null,null,null,null,null,null,null,null,"baseline - code target  - Not selected"]
[null,null,null,"Plan","Component",null,"Door",null,"Width",null,"Height",null,null,null,null,null,null,null,"Plan","Component",null,"Door",null,"Width",null,"Height",null,null,null,null,null,null,null,null,null,null,"drop down on Project type"]
[null,null,null,"ID","Description","Ref.","U","Qt.","Feet","Inch","Feet","Inch","Area","UA",null,null,null,null,"ID","Description","Ref.","U","Qt.","Feet","Inch","Feet","Inch","Area","UA"]
[null,null,null,"Exempt",null,{"$f":"IFERROR(VLOOKUP($E74,Table_Doors,2,FALSE),\"\")","v":""},{"$f":"IFERROR(VLOOKUP($E74,Table_Doors,3,FALSE),\"\")","v":""},null,null,null,null,null,{"$f":"IFERROR(H74*(I74+(J74/12))*(K74+(L74/12)),\"\")","v":0},{"$f":"IFERROR(G74*M74,0)","v":0},{"$f":"IF(AND(M74>24,F19<>\"R2 Multifamily\"),1,IF(AND(F74=\"Custom\",G74=0),1,IF(AND(G74=\"\",SUM(H74:L74)=0),0,IF(AND(G74<>\"\",M74>0),0,1))))","v":0},{"$f":"IF(M74>24,IF(F19=\"R2 Multifamily\",\"Verify exempt doors are 24sf or less per dwelling unit.\",\"Exempt Door>24 sf\"),IF(F74=\"Custom\",IF(G74=0,\"U-value missing in Custom Input\",\"Refer to WSEC R402.1.5 U-factor Reference and Calculations\"),\"\"))","v":""}]
[null,null,null,"S front door","Code Baseline, U=0.30",0,0.3,1,3,2,6,10,21.638888888888886,{"$f":"IFERROR(G75*M75,0)","v":6.4916666666666654},{"$f":"IF(AND(TRIM(E75)=\"\",OR(M75=0,M75=\"\")),0,IF(AND(E75=\"\",M75>0),1,IF(AND(E75<>\"\",N75=0),1,IF(AND(F75=\"Custom\",G75=0),1,IF(AND(G75=\"\",SUM(H75:L75)=0),0,IF(AND(G75<>\"\",M75>0),0,1))))))","v":0},{"$f":"IF(F75=\"Custom\",IF(G75=0,\"U-value missing in Custom Input\",\"Refer to WSEC R402.1.5 U-factor Reference and Calculations\"),\"\")","v":""},null," ",null,"Code Baseline, U=0.30",{"$f":"IFERROR(VLOOKUP($T75,Table_Doors,2,FALSE),\"\")","v":0},{"$f":"IFERROR(VLOOKUP($T75,Table_Doors,3,FALSE),\"\")","v":0.3},1,3,null,6,8,{"$f":"W75*(X75+(Y75/12))*(Z75+(AA75/12))","v":20},{"$f":"IFERROR(V75*AB75,0)","v":6},{"$f":"IF(AND(T75=\"\",AB75=0),0,IF(AND(T75=\"\",AB75>0),1,IF(AND(T75<>\"\",AC75=0),1,IF(AND(U75=\"Custom\",V75=0),1,IF(AND(V75=\"\",SUM(W75:AA75)=0),0,IF(AND(V75<>\"\",AB75>0),0,1))))))","v":0},{"$f":"IF(U75=\"Custom\",\"Refer to WSEC R402.1.5 U-factor Reference and Calculations\",\"\")","v":""},null,null,null,null,null,"flag if U-value=0"]
[null,null,null,"N patio door","Code Baseline, U=0.30",0,0.3,1,7,0,6,10,47.833333333333329,{"$f":"IFERROR(G76*M76,0)","v":14.349999999999998},0,{"$f":"IF(F76=\"Custom\",IF(G76=0,\"U-value missing in Custom Input\",\"Refer to WSEC R402.1.5 U-factor Reference and Calculations\"),\"\")","v":""},null," ",null,null,"","",null,null,null,null,null,0,{"$f":"IFERROR(V76*AB76,0)","v":0},{"$f":"IF(AND(T76=\"\",AB76=0),0,IF(AND(T76=\"\",AB76>0),1,IF(AND(T76<>\"\",AC76=0),1,IF(AND(U76=\"Custom\",V76=0),1,IF(AND(V76=\"\",SUM(W76:AA76)=0),0,IF(AND(V76<>\"\",AB76>0),0,1))))))","v":0},{"$f":"IF(U76=\"Custom\",\"Refer to WSEC R402.1.5 U-factor Reference and Calculations\",\"\")","v":""}]
[null,null,null,"W garage door","Code Baseline, U=0.30",0,0.3,1,3,2,6,10,21.638888888888886,6.4916666666666654,0,"",null," ",null,null,"","",null,null,null,null,null,0,0,0,"",null,null,null,null,null,"Error checking"]
[null,null,null,null,null,"","",null,null,null,null,null,0,{"$f":"IFERROR(G78*M78,0)","v":0},{"$f":"IF(AND(TRIM(E78)=\"\",OR(M78=0,M78=\"\")),0,IF(AND(E78=\"\",M78>0),1,IF(AND(E78<>\"\",N78=0),1,IF(AND(F78=\"Custom\",G78=0),1,IF(AND(G78=\"\",SUM(H78:L78)=0),0,IF(AND(G78<>\"\",M78>0),0,1))))))","v":0},{"$f":"IF(F78=\"Custom\",IF(G78=0,\"U-value missing in Custom Input\",\"Refer to WSEC R402.1.5 U-factor Reference and Calculations\"),\"\")","v":""},null," ",null,null,"","",null,null,null,null,null,0,0,0,"",null,null,null,null,null,"Windows can't be below U0.14"]
[null,null,null,null,null,"","",null,null,null,null,null,0,0,{"$f":"IF(AND(TRIM(E79)=\"\",OR(M79=0,M79=\"\")),0,IF(AND(E79=\"\",M79>0),1,IF(AND(E79<>\"\",N79=0),1,IF(AND(F79=\"Custom\",G79=0),1,IF(AND(G79=\"\",SUM(H79:L79)=0),0,IF(AND(G79<>\"\",M79>0),0,1))))))","v":0},""]
[null,null,null,null,null,"","",null,null,null,null,null,0,{"$f":"IFERROR(G80*M80,0)","v":0},0,{"$f":"IF(F80=\"Custom\",IF(G80=0,\"U-value missing in Custom Input\",\"Refer to WSEC R402.1.5 U-factor Reference and Calculations\"),\"\")","v":""}]
[null,null,null,null,null,"","",null,null,null,null,null,0,0,0,""]
[null,null,null,null,null,"","",null,null,null,null,null,0,0,0,"",null," ",null,null,"","",null,null,null,null,null,0,0,0,""]
[null,null,null,null,null,"","",null,null,null,null,null,0,0,0,"",null," ",null,null,"","",null,null,null,null,null,0,0,0,""]
[null,null,null,null,null,"","",null,null,null,null,null,0,0,0,"",null," ",null,null,"","",null,null,null,null,null,0,0,0,"",null,null,null,null,null,"For 2018 version "]
[null,null,null,null,null,null,null,null,null,null,null,{"$f":"IF(AND(M74>0,Switch_ShowExempt=\"Show\"),\"Sum of Area and UA (excluding exempt door)\",\"Sum of Area and UA\")","v":"Sum of Area and UA"},{"$f":"IF(O85>0,\"\",SUM(M75:M84))","v":91.1111111111111},{"$f":"IF(O85>0,\"Erorr\",SUM(N75:N84))","v":27.333333333333329},{"$f":"SUBTOTAL(109,O74:O84)","v":0},{"$f":"ROW(P84)-ROW(P74)+1-COUNTBLANK(P74:P84)","v":0},null,null,null,null,null,null,"Sum of Area and UA",null,null,null,null,{"$f":"IF(AD85>0,\"\",SUM(AB75:AB84))","v":20},{"$f":"IF(AD85>0,\"Erorr\",SUM(AC75:AC84))","v":6},{"$f":"SUM(AD75:AD84)","v":0},{"$f":"ROW(AE84)-ROW(AE75)+1-COUNTBLANK(AE75:AE84)","v":0},null,null,null,null,null,"Brief description of options in Table R406"]
[null,null,null,null,null,null,null,null,null,null,null,"Exterior Doors Area Weighted U",null,{"$f":"IFERROR(N85/M85,\"\")","v":0.3},null,null,null,null,null,null,null,null,null,null,null,null,{"$f":"L86","v":"Exterior Doors Area Weighted U"},null,{"$f":"IFERROR(AC85/AB85,\"\")","v":0.3}]
[null,null,null,null,null,null,null,null,null,null,null,null,null,null,null,null,null,null,null,null,null,null,null,null,null,null,null,null,null,null,null,null,null,null,null,null,"Code target on most frequently selected"]
[]
[null,null,null,"Overhead Glazing",null,null,null,null,null,null,null,null,null,null,null,null,null,null,"Overhead Glazing: "]
[null,null,null,"Plan","Component","Ref.","Glazing","Qt.","Width",null,"Height",null,"Area","UA",null,null,null,null,"Plan","Component","Ref.","Glazing","Qt.","Width",null,"Height",null,"Area","UA"]
[null,null,null,"ID","Description",null,"U",null,"Feet","Inch","Feet","Inch",null,null,null,null,null,null,"ID","Description",null,"U",null,"Feet","Inch","Feet","Inch"]
[null,null,null,null,null,{"$f":"IFERROR(VLOOKUP($E92,Table_OverheadGlazing,2,FALSE),\"\")","v":""},{"$f":"IFERROR(VLOOKUP($E92,Table_OverheadGlazing,3,FALSE),\"\")","v":""},null,null,null,null,null,{"$f":"IFERROR(H92*(I92+(J92/12))*(K92+(L92/12)),\"\")","v":0},{"$f":"IFERROR(G92*M92,\"\")","v":""},{"$f":"IF(AND(TRIM(E92)=\"\",OR(M92=0,M92=\"\")),0,IF(AND(E92=\"\",M92>0),1,IF(AND(E92<>\"\",N92=0),1,IF(AND(F92=\"Custom\",G92=0),1,IF(AND(G92=\"\",SUM(H92:L92)=0),0,IF(AND(G92<>\"\",M92>0),0,1))))))","v":0},{"$f":"IF(F92=\"Custom\",IF(G92=0,\"U-value missing in Custom Input\",\"Refer to WSEC R402.1.5 U-factor Reference and Calculations\"),\"\")","v":""},null," ",null,null,{"$f":"IFERROR(VLOOKUP($T92,Table_OverheadGlazing,2,FALSE),\"\")","v":""},{"$f":"IFERROR(VLOOKUP($T92,Table_OverheadGlazing,3,FALSE),\"\")","v":""},null,null,null,null,null,{"$f":"W92*(X92+(Y92/12))*(Z92+(AA92/12))","v":0},{"$f":"IFERROR(V92*AB92,\"\")","v":""},{"$f":"IF(AND(T92<>\"\",V92=\"\"),1,IF(AND(T92=\"\",AB92=0),0,IF(AND(T92=\"\",AB92>0),1,IF(AND(T92<>\"\",AC92=0),1,IF(AND(U92=\"Custom\",V92=0),1,IF(AND(V92=\"\",SUM(W92:AA92)=0),0,IF(AND(V92<>\"\",AB92>0),0,1)))))))","v":0},{"$f":"IF(U92=\"Custom\",\"Refer to WSEC R402.1.5 U-factor Reference and Calculations\",\"\")","v":""}]
[null,null,null,null,null,{"$f":"IFERROR(VLOOKUP($E93,Table_OverheadGlazing,2,FALSE),\"\")","v":""},{"$f":"IFERROR(VLOOKUP($E93,Table_OverheadGlazing,3,FALSE),\"\")","v":""},null,null,null,null,null,0,{"$f":"IFERROR(G93*M93,\"\")","v":""},0,"",null," ",null,null,{"$f":"IFERROR(VLOOKUP($T93,Table_OverheadGlazing,2,FALSE),\"\")","v":""},{"$f":"IFERROR(VLOOKUP($T93,Table_OverheadGlazing,3,FALSE),\"\")","v":""},null,null,null,null,null,{"$f":"W93*(X93+(Y93/12))*(Z93+(AA93/12))","v":0},{"$f":"IFERROR(V93*AB93,\"\")","v":""},0,{"$f":"IF(U93=\"Custom\",\"Refer to WSEC R402.1.5 U-factor Reference and Calculations\",\"\")","v":""}]
[null,null,null,null,null,{"$f":"IFERROR(VLOOKUP($E94,Table_OverheadGlazing,2,FALSE),\"\")","v":""},{"$f":"IFERROR(VLOOKUP($E94,Table_OverheadGlazing,3,FALSE),\"\")","v":""},null,null,null,null,null,0,{"$f":"IFERROR(G94*M94,\"\")","v":""},0,"",null," ",null,null,{"$f":"IFERROR(VLOOKUP($T94,Table_OverheadGlazing,2,FALSE),\"\")","v":""},{"$f":"IFERROR(VLOOKUP($T94,Table_OverheadGlazing,3,FALSE),\"\")","v":""},null,null,null,null,null,{"$f":"W94*(X94+(Y94/12))*(Z94+(AA94/12))","v":0},{"$f":"IFERROR(V94*AB94,\"\")","v":""},0,{"$f":"IF(U94=\"Custom\",\"Refer to WSEC R402.1.5 U-factor Reference and Calculations\",\"\")","v":""}]
[null,null,null,null,null,{"$f":"IFERROR(VLOOKUP($E95,Table_OverheadGlazing,2,FALSE),\"\")","v":""},{"$f":"IFERROR(VLOOKUP($E95,Table_OverheadGlazing,3,FALSE),\"\")","v":""},null,null,null,null,null,0,{"$f":"IFERROR(G95*M95,\"\")","v":""},0,"",null," ",null,null,{"$f":"IFERROR(VLOOKUP($T95,Table_OverheadGlazing,2,FALSE),\"\")","v":""},{"$f":"IFERROR(VLOOKUP($T95,Table_OverheadGlazing,3,FALSE),\"\")","v":""},null,null,null,null,null,{"$f":"W95*(X95+(Y95/12))*(Z95+(AA95/12))","v":0},{"$f":"IFERROR(V95*AB95,\"\")","v":""},0,{"$f":"IF(U95=\"Custom\",\"Refer to WSEC R402.1.5 U-factor Reference and Calculations\",\"\")","v":""}]
[null,null,null,null,null,{"$f":"IFERROR(VLOOKUP($E96,Table_OverheadGlazing,2,FALSE),\"\")","v":""},{"$f":"IFERROR(VLOOKUP($E96,Table_OverheadGlazing,3,FALSE),\"\")","v":""},null,null,null,null,null,0,{"$f":"IFERROR(G96*M96,\"\")","v":""},0,"",null," ",null,null,{"$f":"IFERROR(VLOOKUP($T96,Table_OverheadGlazing,2,FALSE),\"\")","v":""},{"$f":"IFERROR(VLOOKUP($T96,Table_OverheadGlazing,3,FALSE),\"\")","v":""},null,null,null,null,null,{"$f":"W96*(X96+(Y96/12))*(Z96+(AA96/12))","v":0},{"$f":"IFERROR(V96*AB96,\"\")","v":""},0,{"$f":"IF(U96=\"Custom\",\"Refer to WSEC R402.1.5 U-factor Reference and Calculations\",\"\")","v":""}]
[null,null,null,null,null,null,null,"Sum of Area and UA",null,null,null,null,{"$f":"IF(O97>0,\"\",SUM(M92:M96))","v":0},{"$f":"IF(O97>0,\"Error\",SUM(N92:N96))","v":0},{"$f":"SUM(O92:O96)","v":0},{"$f":"ROW(P96)-ROW(P92)+1-COUNTBLANK(P92:P96)","v":0},null,null,null,null,null,null,"Sum of Area and UA",null,null,null,null,{"$f":"IF(AD97>0,\"\",SUM(AB92:AB96))","v":0},{"$f":"IF(AD97>0,\"Error\",SUM(AC92:AC96))","v":0},{"$f":"SUM(AD90:AD96)","v":0},{"$f":"ROW(AE96)-ROW(AE92)+1-COUNTBLANK(AE92:AE96)","v":0}]
[null,null,null,null,null,null,null,null,null,null,null,"Overhead Glazing Area Weighted U",null,{"$f":"IFERROR(N97/M97,\"\")","v":""},{"$f":"IF(AND(N98<>\"\",N98>0.75),1,0)","v":0},{"$f":"IF(O98=1,\"Area-weighted average U-factor exceeds max permitted in Section R402.5\",\"\")","v":""},null,null,null,null,null,null,null,null,null,null,{"$f":"L98","v":"Overhead Glazing Area Weighted U"},null,{"$f":"IFERROR(AC97/AB97,\"\")","v":""}]
[]
[]
[null,null,null,"Vertical Glazing Schedule",null,null,null,null,null,null,null,null,"Rows to Show",16,null,null,null,null,"Vertical Glazing"]
[null,null,null,"Plan","Component","Ref.","Glazing","Qt.","Width",null,"Height",null,"Area","UA",null,null,null,null,"Plan","Component","Ref.","Glazing","Qt.","Width",null,"Height",null,"Area","UA"]
[null,null,null,"ID","Description",null,"U",null,"Feet","Inch","Feet","Inch",null,null,null,null,null," ","ID","Description",null,"U",null,"Feet","Inch","Feet","Inch"]
[null,null,null,"Exempt",null,{"$f":"IFERROR(VLOOKUP($E104,Table_VerticalGlazing,2,FALSE),\"\")","v":""},{"$f":"IFERROR(VLOOKUP($E104,Table_VerticalGlazing,3,FALSE),0)","v":0},null,null,null,null,null,{"$f":"IFERROR(H104*(I104+(J104/12))*(K104+(L104/12)),\"\")","v":0},{"$f":"IFERROR(G104*M104,0)","v":0},{"$f":"IF(AND(M104>15,F19<>\"R2 Multifamily\"),1,IF(AND(E104=\"\",M104=0),0,IF(AND(E104=\"\",M104>0),1,IF(AND(E104<>\"\",N104=0),1,IF(AND(F104=\"Custom\",G104=0),1,IF(AND(G104=\"\",SUM(H104:L104)=0),0,IF(AND(G104<>\"\",M104>0),0,1)))))))","v":0},{"$f":"IF(AND(E104<>\"\",G104>0.48),\"U-value exceeds maximum permitted for tradeoffs (Section R402.5)\",IF(F104=\"Custom\",IF(G104=0,\"U-value missing in Custom Input\",\"Refer to WSEC R402.1.5 U-factor Reference and Calculations\"),\"\"))","v":""}]
[null,null,1,"N down","U=0.28 (2018 1.3, 1.7)","Table 406.2 / 406.3",{"$f":"IFERROR(VLOOKUP($E105,Table_VerticalGlazing,3,FALSE),\"\")","v":0.28000000000000003},2,5,6,3,6,{"$f":"IFERROR(H105*(I105+(J105/12))*(K105+(L105/12)),\"\")","v":38.5},{"$f":"IFERROR(G105*M105,0)","v":10.780000000000001},{"$f":"IF(AND(TRIM(E105)=\"\",OR(M105=0,M105=\"\")),0,IF(AND(E105=\"\",M105>0),1,IF(AND(E105<>\"\",N105=0),1,IF(AND(F105=\"Custom\",G105=0),1,IF(AND(G105=\"\",SUM(H105:L105)=0),0,IF(AND(G105<>\"\",M105>0),0,1))))))","v":0},{"$f":"IF(F105=\"Custom\",IF(G105=0,\"U-value missing in Custom Input\",\"Refer to WSEC R402.1.5 U-factor Reference and Calculations\"),\"\")","v":""},null," ",null,"3gl Wood/vinyl, Low-e2 ½\" + argon (Code Baseline)",{"$f":"IFERROR(VLOOKUP($T105,Table_VerticalGlazing,2,FALSE),\"\")","v":"10-6B"},{"$f":"IFERROR(VLOOKUP(T105,Table_VerticalGlazing,3,FALSE),0)","v":0.3},8,5,null,4,null,{"$f":"W105*(X105+(Y105/12))*(Z105+(AA105/12))","v":160},{"$f":"IFERROR(V105*AB105,0)","v":48},{"$f":"IF(AND(T105=\"\",AB105=0),0,IF(AND(T105=\"\",AB105>0),1,IF(AND(T105<>\"\",AC105=0),1,IF(AND(U105=\"Custom\",V105=0),1,IF(AND(V105=\"\",SUM(W105:AA105)=0),0,IF(AND(V105<>\"\",AB105>0),0,1))))))","v":0},{"$f":"IF(U105=\"Custom\",\"Refer to WSEC R402.1.5 U-factor Reference and Calculations\",\"\")","v":""}]
[null,null,{"$f":"C105+1","v":2},"N down","U=0.28 (2018 1.3, 1.7)","Table 406.2 / 406.3",0.28000000000000003,1,3,0,3,6,10.5,{"$f":"IFERROR(G106*M106,0)","v":2.9400000000000004},0,{"$f":"IF(F106=\"Custom\",IF(G106=0,\"U-value missing in Custom Input\",\"Refer to WSEC R402.1.5 U-factor Reference and Calculations\"),\"\")","v":""},null," ",null,null,"",0,null,null,null,null,null,0,{"$f":"IFERROR(V106*AB106,0)","v":0},{"$f":"IF(AND(T106=\"\",AB106=0),0,IF(AND(T106=\"\",AB106>0),1,IF(AND(T106<>\"\",AC106=0),1,IF(AND(U106=\"Custom\",V106=0),1,IF(AND(V106=\"\",SUM(W106:AA106)=0),0,IF(AND(V106<>\"\",AB106>0),0,1))))))","v":0},{"$f":"IF(U106=\"Custom\",\"Refer to WSEC R402.1.5 U-factor Reference and Calculations\",\"\")","v":""}]
[null,null,{"$f":"C106+1","v":3},"E down","U=0.28 (2018 1.3, 1.7)","Table 406.2 / 406.3",0.28000000000000003,1,6,0,4,0,24,{"$f":"IFERROR(G107*M107,0)","v":6.7200000000000006},0,"",null," ",null,null,"",0,null,null,null,null,null,0,0,0,""]
[null,null,4,"S down","U=0.28 (2018 1.3, 1.7)","Table 406.2 / 406.3",0.28000000000000003,1,5,6,3,6,19.25,5.3900000000000006,0,"",null," ",null,null,"",0,null,null,null,null,null,0,0,0,""]
[null,null,5,"S down","U=0.28 (2018 1.3, 1.7)","Table 406.2 / 406.3",0.28000000000000003,1,2,0,2,6,5,1.4000000000000001,0,"",null," ",null,null,"",0,null,null,null,null,null,0,0,0,""]
[null,null,6,"W up","U=0.28 (2018 1.3, 1.7)","Table 406.2 / 406.3",0.28000000000000003,2,5,0,3,6,35,9.8000000000000007,0,"",null," ",null,null,"",0,null,null,null,null,null,0,0,0,""]
[null,null,7,null," ","","",null,null,null,null,null,0,0,0,"",null," ",null,null,"",0,null,null,null,null,null,0,0,0,""]
[null,null,8,null,null,"","",null,null,null,null,null,0,0,0,"",null," ",null,null,"",0,null,null,null,null,null,0,0,0,""]
[null,null,9,null,null,"","",null,null,null,null,null,0,0,0,"",null," ",null,null,"",0,null,null,null,null,null,0,0,0,""]
[null,null,10,null,null,"","",null,null,null,null,null,0,0,0,"",null," ",null,null,"",0,null,null,null,null,null,0,0,0,""]
[null,null,11,null,null,"","",null,null,null,null,null,0,0,0,"",null," ",null,null,"",0,null,null,null,null,null,0,0,0,""]
[null,null,12,null,null,"","",null,null,null,null,null,0,0,0,"",null," ",null,null,"",0,null,null,null,null,null,0,0,0,""]
[null,null,13,null,null,"","",null,null,null,null,null,0,0,0,"",null," ",null,null,"",0,null,null,null,null,null,0,0,0,""]
[null,null,14,null,null,"","",null,null,null,null,null,0,0,0,"",null," ",null,null,"",0,null,null,null,null,null,0,0,0,""]
[null,null,15,null,null,"","",null,null,null,null,null,0,0,0,"",null," ",null,null,"",0,null,null,null,null,null,0,0,0,""]
[null,null,16,null,null,"","",null,null,null,null,null,0,0,0,"",null," ",null,null,"",0,null,null,null,null,null,0,0,0,""]
[null,null,17,null,null,"","",null,null,null,null,null,0,0,0,"",null," ",null,null,"",0,null,null,null,null,null,0,0,0,""]
[null,null,18,null,null,"","",null,null,null,null,null,0,0,0,"",null," ",null,null,"",0,null,null,null,null,null,0,0,0,""]
[null,null,19,null,null,"","",null,null,null,null,null,0,0,0,"",null," ",null,null,"",0,null,null,null,null,null,0,0,0,""]
[null,null,20,null,null,"","",null,null,null,null,null,0,0,0,"",null," ",null,null,"",0,null,null,null,null,null,0,0,0,""]
[null,null,21,null,null,"","",null,null,null,null,null,0,0,0,"",null," ",null,null,"",0,null,null,null,null,null,0,0,0,""]
[null,null,22,null,null,"","",null,null,null,null,null,0,0,0,"",null," ",null,null,"",0,null,null,null,null,null,0,0,0,""]
[null,null,23,null,null,"","",null,null,null,null,null,0,0,0,"",null," ",null,null,"",0,null,null,null,null,null,0,0,0,""]
[null,null,24,null,null,"","",null,null,null,null,null,0,0,0,"",null," ",null,null,"",0,null,null,null,null,null,0,0,0,""]
[null,null,25,null,null,"","",null,null,null,null,null,0,0,0,"",null," ",null,null,"",0,null,null,null,null,null,0,0,0,""]
[null,null,26,null,null,"","",null,null,null,null,null,0,0,0,"",null," ",null,null,"",0,null,null,null,null,null,0,0,0,""]
[null,null,27,null,null,"","",null,null,null,null,null,0,0,0,"",null," ",null,null,"",0,null,null,null,null,null,0,0,0,""]
[null,null,28,null,null,"","",null,null,null,null,null,0,0,0,"",null," ",null,null,"",0,null,null,null,null,null,0,0,0,""]
[null,null,29,null,null,"","",null,null,null,null,null,0,0,0,"",null," ",null,null,"",0,null,null,null,null,null,0,0,0,""]
[null,null,30,null,null,"","",null,null,null,null,null,0,0,0,"",null," ",null,null,"",0,null,null,null,null,null,0,0,0,""]
[null,null,31,null,null,"","",null,null,null,null,null,0,0,0,"",null," ",null,null,"",0,null,null,null,null,null,0,0,0,""]
[null,null,32,null,null,"","",null,null,null,null,null,0,0,0,"",null," ",null,null,"",0,null,null,null,null,null,0,0,0,""]
[null,null,33,null,null,"",{"$f":"IFERROR(VLOOKUP($E137,Table_VerticalGlazing,3,FALSE),\"\")","v":""},null,null,null,null,null,0,0,0,"",null," ",null,null,{"$f":"IFERROR(VLOOKUP($T137,Table_VerticalGlazing,2,FALSE),\"\")","v":""},{"$f":"IFERROR(VLOOKUP(T137,Table_VerticalGlazing,3,FALSE),0)","v":0},null,null,null,null,null,0,0,0,""]
[null,null,34,null,null,"","",null,null,null,null,null,0,0,0,"",null," ",null,null,"",0,null,null,null,null,null,0,0,0,""]
[null,null,35,null,null,"","",null,null,null,null,null,0,0,0,"",null," ",null,null,"",0,null,null,null,null,null,0,0,0,""]
[null,null,36,null,null,"","",null,null,null,null,null,0,0,0,"",null," ",null,null,"",0,null,null,null,null,null,0,0,0,""]
[null,null,37,null,null,"","",null,null,null,null,null,0,{"$f":"IFERROR(G141*M141,0)","v":0},0,"",null," ",null,null,"",0,null,null,null,null,null,0,0,0,""]
[null,null,38,null,null,"","",null,null,null,null,null,0,0,0,"",null," ",null,null,"",0,null,null,null,null,null,0,0,0,""]
[null,null,39,null,null,"","",null,null,null,null,null,0,0,0,"",null," ",null,null,"",0,null,null,null,null,null,0,0,0,""]
[null,null,40,null,null,"","",null,null,null,null,null,0,0,0,"",null," ",null,null,"",0,null,null,null,null,null,0,0,0,""]
[null,null,41,null,null,"","",null,null,null,null,null,0,0,0,"",null," ",null,null,"",0,null,null,null,null,null,0,0,0,""]
[null,null,42,null,null,"","",null,null,null,null,null,{"$f":"IFERROR(H146*(I146+(J146/12))*(K146+(L146/12)),\"\")","v":0},{"$f":"IFERROR(G146*M146,0)","v":0},0,"",null," ",null,null,"",0,null,null,null,null,null,0,0,0,""]
[null,null,43,null,null,"","",null,null,null,null,null,0,0,0,""]
[null,null,44,null,null,"","",null,null,null,null,null,0,0,0,""]
[null,null,45,null,null,"","",null,null,null,null,null,0,0,0,""]
[null,null,46,null,null,"","",null,null,null,null,null,0,0,0,""]
[null,null,47,null,null,"","",null,null,null,null,null,0,0,0,""]
[null,null,48,null,null,"","",null,null,null,null,null,0,0,0,"",null," ",null,null,"",0,null,null,null,null,null,0,0,0,""]
[null,null,49,null,null,"","",null,null,null,null,null,0,0,0,"",null," ",null,null,"",0,null,null,null,null,null,0,0,0,""]
[null,null,50,null,null,"","",null,null,null,null,null,0,0,0,"",null," ",null,null,"",0,null,null,null,null,null,0,0,0,""]
[null,null,51,null,null,"","",null,null,null,null,null,0,0,0,"",null," ",null,null,"",0,null,null,null,null,null,0,0,0,""]
[null,null,52,null,null,"","",null,null,null,null,null,0,0,0,"",null," ",null,null,"",0,null,null,null,null,null,0,0,0,""]
[null,null,53,null,null,"","",null,null,null,null,null,0,0,0,"",null," ",null,null,"",0,null,null,null,null,null,0,0,0,""]
[null,null,54,null,null,"","",null,null,null,null,null,0,0,0,"",null," ",null,null,"",0,null,null,null,null,null,0,0,0,""]
[null,null,55,null,null,"","",null,null,null,null,null,0,0,0,"",null," ",null,null,"",0,null,null,null,null,null,0,0,0,""]
[null,null,56,null,null,"","",null,null,null,null,null,0,0,0,"",null," ",null,null,"",0,null,null,null,null,null,0,0,0,""]
[null,null,57,null,null,"","",null,null,null,null,null,0,0,0,"",null," ",null,null,"",0,null,null,null,null,null,0,0,0,""]
[null,null,58,null,null,"","",null,null,null,null,null,0,0,0,"",null," ",null,null,"",0,null,null,null,null,null,0,0,0,""]
[null,null,59,null,null,"","",null,null,null,null,null,0,0,0,"",null," ",null,null,"",0,null,null,null,null,null,0,0,0,""]
[null,null,60,null,null,"","",null,null,null,null,null,0,0,0,"",null," ",null,null,"",0,null,null,null,null,null,0,0,0,""]
[null,null,null,null,null,null,null,null,null,null,null,{"$f":"IF(AND(M104>0,Switch_ShowExempt=\"Show\"),\"Sum of Area and UA (excluding exempt window)\",\"Sum of Area and UA\")","v":"Sum of Area and UA"},{"$f":"IF(O165>0,\"\",SUBTOTAL(109,M105:M164))","v":132.25},{"$f":"IF(O165>0,\"Error\",SUBTOTAL(109,N105:N164))","v":37.03},{"$f":"SUBTOTAL(109,O104:O164)","v":0},{"$f":"ROW(P164)-ROW(P104)+1-COUNTBLANK(P104:P164)","v":0},null,null,null,null,null,null,null,null,null,null,"Sum of Area and UA",{"$f":"IF(AD165>0,\"\",SUBTOTAL(109,AB105:AB164))","v":160},{"$f":"IF(AD165>0,\"Error\",SUBTOTAL(109,AC105:AC164))","v":48},{"$f":"SUBTOTAL(109,AD105:AD164)","v":0},{"$f":"ROW(AE164)-ROW(AE105)+1-COUNTBLANK(AE105:AE164)","v":0}]
[null,null,null,null,null,null,null,null,null,null,null,"Vertical Glazing Area Weighted U",null,{"$f":"IFERROR(N165/M165,\"\")","v":0.28000000000000003},{"$f":"IF(AND(N166<>\"\",N166>0.48,Menu_ProjectType<>Item_ProjectType_RemodelAlteration),1,0)","v":0},{"$f":"IF(AND(N166<>\"\",N166>0.48,Menu_ProjectType<>Item_ProjectType_RemodelAlteration),\"Area-weighted average U-factor exceeds max permitted in Section R402.5\",\"\")","v":""},null,null,null,null,null,null,null,null,null,null,{"$f":"L166","v":"Vertical Glazing Area Weighted U"},null,{"$f":"IFERROR(AC165/AB165,\"\")","v":0.3}]
[null,null,null,null,null,null,null,null,null,null,null,"Vertical Glazing and Doors Area Weighted U",null,{"$f":"IFERROR((N165+N85)/(M165+M85),\"Error\")","v":0.2881581892799403},null,null,null,null,null,null,null,null,null,null,null,null,"Vertical Glazing and Doors Area Weighted U",null,{"$f":"IFERROR((AC165+AC85)/(AB165+AB85),\"Error\")","v":0.3}]
[]
[]
[null,null,null,"Flat/Vaulted Ceilings",null,null,null,null,null,null,null,null,null,null,null,null,null,null,"Flat/Vaulted Ceilings"]
[null,null,null,"Plan","Component","Ref.","Attic",null,null,null,null,null,"Area","UA",null,null,null," ","Plan","Component","Ref.","Attic",null,null,null,null,null,"Area","UA"]
[null,null,null,"ID","Description",null,"U",null,null,null,null,null,null,null,null,null,null," ","ID","Description",null,"U"]
[null,null,null,"Flat ","R60 blown Attic STD baffled",{"$f":"IFERROR(VLOOKUP($E173,Table_FlatVaultedCeilings,2,FALSE),\"\")","v":"10-7"},{"$f":"IFERROR(VLOOKUP($E173,Table_FlatVaultedCeilings,3,FALSE),+\"\")","v":2.5000000000000001E-2},null,null,null,null,{"$f":"IF(AND(F173=\"NA\",M173<>\"\"), \"Leave area blank\",\"\")","v":""},1578,{"$f":"IFERROR(G173*M173,\"\")","v":39.450000000000003},{"$f":"IF(L173<>\"\",1,IF(F173=\"NA\",0,IF(AND(TRIM(E173)<>\"\",OR(ISNUMBER(M173)=FALSE,G173=\"\")),1,IF(AND(TRIM(E173)=\"\",G173=\"\",TRIM(M173)=\"\"),0,IF(AND(F173=\"Custom\",G173=0),1,IF(AND(G173<>\"\",N173=0),1,IF(AND(G173=\"\",M173>0),1,0)))))))","v":0},{"$f":"IF(F173=\"Custom\",IF(G173=0,\"U-value missing in Custom Input\",\"Refer to WSEC R402.1.5 U-factor Reference and Calculations\"),\"\")","v":""},null," ",null,"R49 blown Attic ADV baffled (2018 1.5, 1.7, 2021 Code Baseline)",{"$f":"IFERROR(VLOOKUP(T173,Table_FlatVaultedCeilings,2,FALSE),\"\")","v":"10-7"},{"$f":"IFERROR(VLOOKUP(T173,Table_FlatVaultedCeilings,3,FALSE),+\"\")","v":0.02},null,null,null,null,null,491,{"$f":"IFERROR(V173*AB173,\"\")","v":9.82},{"$f":"IF(AND(T173<>\"\",OR(ISNUMBER(AB173)=FALSE,V173=\"\")),1,IF(AND(T173=\"\",V173=\"\",AB173=\"\"),0,IF(AND(U173=\"Custom\",V173=0),1,IF(AND(V173<>\"\",AC173=0),1,IF(AND(V173=\"\",AB173>0),1,0)))))","v":0},{"$f":"IF(U173=\"Custom\",\"Refer to WSEC R402.1.5 U-factor Reference and Calculations\",\"\")","v":""}]
[null,null,null,null," ",{"$f":"IFERROR(VLOOKUP($E174,Table_FlatVaultedCeilings,2,FALSE),\"\")","v":""},{"$f":"IFERROR(VLOOKUP($E174,Table_FlatVaultedCeilings,3,FALSE),+\"\")","v":""},null,null,null,null,{"$f":"IF(AND(F174=\"NA\",M174<>\"\"), \"Error: Leave area blank\",\"\")","v":""},null,{"$f":"IFERROR(G174*M174,\"\")","v":""},{"$f":"IF(L174<>\"\",1,IF(F174=\"NA\",0,IF(AND(TRIM(E174)<>\"\",OR(ISNUMBER(M174)=FALSE,G174=\"\")),1,IF(AND(TRIM(E174)=\"\",G174=\"\",TRIM(M174)=\"\"),0,IF(AND(F174=\"Custom\",G174=0),1,IF(AND(G174<>\"\",N174=0),1,IF(AND(G174=\"\",M174>0),1,0)))))))","v":0},{"$f":"IF(F174=\"Custom\",IF(G174=0,\"U-value missing in Custom Input\",\"Refer to WSEC R402.1.5 U-factor Reference and Calculations\"),\"\")","v":""},null," ",null,null,{"$f":"IFERROR(VLOOKUP(T174,Table_FlatVaultedCeilings,2,FALSE),\"\")","v":""},{"$f":"IFERROR(VLOOKUP(T174,Table_FlatVaultedCeilings,3,FALSE),+\"\")","v":""},null,null,null,null,null,null,{"$f":"IFERROR(V174*AB174,\"\")","v":""},0,{"$f":"IF(U174=\"Custom\",\"Refer to WSEC R402.1.5 U-factor Reference and Calculations\",\"\")","v":""}]
[null,null,null,null,null,{"$f":"IFERROR(VLOOKUP($E175,Table_FlatVaultedCeilings,2,FALSE),\"\")","v":""},{"$f":"IFERROR(VLOOKUP($E175,Table_FlatVaultedCeilings,3,FALSE),+\"\")","v":""},null,null,null,null,{"$f":"IF(AND(F175=\"NA\",M175<>\"\"), \"Leave area blank\",\"\")","v":""},null,{"$f":"IFERROR(G175*M175,\"\")","v":""},{"$f":"IF(L175<>\"\",1,IF(F175=\"NA\",0,IF(AND(TRIM(E175)<>\"\",OR(ISNUMBER(M175)=FALSE,G175=\"\")),1,IF(AND(TRIM(E175)=\"\",G175=\"\",TRIM(M175)=\"\"),0,IF(AND(F175=\"Custom\",G175=0),1,IF(AND(G175<>\"\",N175=0),1,IF(AND(G175=\"\",M175>0),1,0)))))))","v":0},{"$f":"IF(F175=\"Custom\",IF(G175=0,\"U-value missing in Custom Input\",\"Refer to WSEC R402.1.5 U-factor Reference and Calculations\"),\"\")","v":""},null," ",null,null,{"$f":"IFERROR(VLOOKUP(T175,Table_FlatVaultedCeilings,2,FALSE),\"\")","v":""},{"$f":"IFERROR(VLOOKUP(T175,Table_FlatVaultedCeilings,3,FALSE),+\"\")","v":""},null,null,null,null,null,null,{"$f":"IFERROR(V175*AB175,\"\")","v":""},0,{"$f":"IF(U175=\"Custom\",\"Refer to WSEC R402.1.5 U-factor Reference and Calculations\",\"\")","v":""}]
[null,null,null,null," ",{"$f":"IFERROR(VLOOKUP($E176,Table_FlatVaultedCeilings,2,FALSE),\"\")","v":""},{"$f":"IFERROR(VLOOKUP($E176,Table_FlatVaultedCeilings,3,FALSE),+\"\")","v":""},null,null,null,null,"",null,{"$f":"IFERROR(G176*M176,\"\")","v":""},0,{"$f":"IF(F176=\"Custom\",IF(G176=0,\"U-value missing in Custom Input\",\"Refer to WSEC R402.1.5 U-factor Reference and Calculations\"),\"\")","v":""},null," ",null,null,{"$f":"IFERROR(VLOOKUP(T176,Table_FlatVaultedCeilings,2,FALSE),\"\")","v":""},{"$f":"IFERROR(VLOOKUP(T176,Table_FlatVaultedCeilings,3,FALSE),+\"\")","v":""},null,null,null,null,null,null,{"$f":"IFERROR(V176*AB176,\"\")","v":""},0,{"$f":"IF(U176=\"Custom\",\"Refer to WSEC R402.1.5 U-factor Reference and Calculations\",\"\")","v":""}]
[null,null,null,null,null,null,null,"Sum of Area and UA",null,null,null,null,{"$f":"IF(O177>0,\"\",SUM(M173:M176))","v":1578},{"$f":"IF(O177>0,\"Error\",SUM(N173:N176))","v":39.450000000000003},{"$f":"SUM(O173:O176)","v":0},{"$f":"ROW(P176)-ROW(P173)+1-COUNTBLANK(P173:P176)","v":0},null," ",null,null,null,null,"Sum of Area and UA",null,null,null,null,{"$f":"IF(AD177>0,\"\",SUM(AB173:AB176))","v":491},{"$f":"IF(AD177>0,\"Error\",SUM(AC173:AC176))","v":9.82},{"$f":"SUM(AD173:AD176)","v":0},{"$f":"ROW(AE176)-ROW(AE173)+1-COUNTBLANK(AE173:AE176)","v":0}]
[null,null,null,null,null,null,null,null,null,null,null,"Area Weighted U-Value",null,{"$f":"IFERROR(N177/M177,\"\")","v":2.5000000000000001E-2},null,null,null,null,null,null,null,null,null,null,null,null,"Area Weighted U-Value",null,{"$f":"IFERROR(AC177/AB177,\"\")","v":0.02}]
[null,null,null,null,null,null,null,null,null,null,null,null,null,null,null,null,null," "]
[]
[null,null,null,"Walls (Above Grade)",null,null,null,null,null,null,null,null,null,null,null,null,null,null,"Walls (Above Grade)"]
[null,null,null,"Plan","Component",null,"Wall",null,null,null,null,null," Net Area",null,null,null,null,null,"Plan","Component",null,"Wall",null,null,null,null,null," Net Area"]
[null,null,null,"ID","Description","Ref.","U",null,null,null,null,null,null,"UA",null,null,null,null,"ID","Description","Ref.","U",null,null,null,null,null,null,"UA"]
[null,null,null,"Down 8.5 ceiling","R21 cavity+R5 foam INT 2X6W T111",{"$f":"IFERROR(VLOOKUP($E184,Table_AboveGradeWalls,2,FALSE),\"\")","v":"10-5"},{"$f":"IFERROR(VLOOKUP($E184,Table_AboveGradeWalls,3,FALSE),+\"\")","v":4.2000000000000003E-2},null,null,null,null,{"$f":"IF(AND(F184=\"NA\",M184<>\"\"), \"Error: Leave area blank\",\"\")","v":""},{"$f":"48.5*8.5*2+40.89*8.5*2-SUM(M105:M109)","v":1422.38},{"$f":"IFERROR(G184*M184,\"\")","v":59.739960000000011},{"$f":"IF(L184<>\"\",1,IF(F184=\"NA\",0,IF(AND(TRIM(E184)<>\"\",OR(ISNUMBER(M184)=FALSE,G184=\"\")),1,IF(AND(TRIM(E184)=\"\",G184=\"\",TRIM(M184)=\"\"),0,IF(AND(F184=\"Custom\",G184=0),1,IF(AND(G184<>\"\",N184=0),1,IF(AND(G184=\"\",M184>0),1,0)))))))","v":0},{"$f":"IF(F184=\"Custom\",\"Refer to WSEC R402.1.5 U-factor Reference and Calculations\",\"\")","v":""},null,null,null,"R21 cavity+R0 foam INT 2X6W T111 (Code Baseline)",{"$f":"IFERROR(VLOOKUP(T184,Table_AboveGradeWalls,2,FALSE),\"\")","v":"10-5"},{"$f":"IFERROR(VLOOKUP(T184,Table_AboveGradeWalls,3,FALSE),+\"\")","v":5.6000000000000001E-2},null,null,null,null,null,1134,{"$f":"IFERROR(V184*AB184,\"\")","v":63.503999999999998},{"$f":"IF(AND(T184<>\"\",OR(ISNUMBER(AB184)=FALSE,V184=\"\")),1,IF(AND(T184=\"\",V184=\"\",AB184=\"\"),0,IF(AND(U184=\"Custom\",V184=0),1,IF(AND(V184<>\"\",AC184=0),1,IF(AND(V184=\"\",AB184>0),1,0)))))","v":0},{"$f":"IF(U184=\"Custom\",\"Refer to WSEC R402.1.5 U-factor Reference and Calculations\",\"\")","v":""}]
[null,null,null,"Up 8.5' ceiling","R21 cavity+R5 foam INT 2X6W T111","10-5",4.2000000000000003E-2,null,null,null,null,null,{"$f":"23.95*8.5*4-M110","v":779.3},{"$f":"IFERROR(G185*M185,\"\")","v":32.730600000000003},0,{"$f":"IF(F185=\"Custom\",\"Refer to WSEC R402.1.5 U-factor Reference and Calculations\",\"\")","v":""},null,null,null,null,"","",null,null,null,null,null,null,{"$f":"IFERROR(V185*AB185,\"\")","v":""},{"$f":"IF(AND(T185<>\"\",OR(ISNUMBER(AB185)=FALSE,V185=\"\")),1,IF(AND(T185=\"\",V185=\"\",AB185=\"\"),0,IF(AND(U185=\"Custom\",V185=0),1,IF(AND(V185<>\"\",AC185=0),1,IF(AND(V185=\"\",AB185>0),1,0)))))","v":0},{"$f":"IF(U185=\"Custom\",\"Refer to WSEC R402.1.5 U-factor Reference and Calculations\",\"\")","v":""}]
[null,null,null,null,null,"","",null,null,null,null,null,null,"",0,"",null,null,null,null,"","",null,null,null,null,null,null,"",0,""]
[null,null,null,null,null,"","",null,null,null,null,null,null,"",0,"",null,null,null,null,"","",null,null,null,null,null,null,"",0,""]
[null,null,null,null," ","","",null,null,null,null,null,null,"",0,"",null,null,null,null,"","",null,null,null,null,null,null,"",0,""]
[null,null,null,null,null,"","",null,null,null,null,"",null,"",0,"",null,null,null,null,"","",null,null,null,null,null,null,"",0,""]
[null,null,null,null,null,"","",null,null,null,null,"",null,"",0,"",null,null,null,null,"","",null,null,null,null,null,null,"",0,""]
[null,null,null,null,null,"","",null,null,null,null,"",null,"",0,"",null,null,null,null,"","",null,null,null,null,null,null,"",0,""]
[null,null,null,null,null,null,null,"Sum of Net Area and UA",null,null,null,null,{"$f":"IF(O192>0,\"\",SUM(M184:M191))","v":2201.6800000000003},{"$f":"IF(O192>0,\"Error\",SUM(N184:N191))","v":92.470560000000006},{"$f":"SUM(O184:O191)","v":0},{"$f":"ROW(P191)-ROW(P184)+1-COUNTBLANK(P184:P191)","v":0},null,null,null,null,null,null,"Sum of Area and UA",null,null,null,null,{"$f":"IF(AD192>0,\"\",SUM(AB184:AB191))","v":1134},{"$f":"IF(AD192>0,\"Error\",SUM(AC184:AC191))","v":63.503999999999998},{"$f":"SUM(AD184:AD191)","v":0},{"$f":"ROW(AE191)-ROW(AE184)+1-COUNTBLANK(AE184:AE191)","v":0}]
[null,null,null,null,null,null,null,null,null,null,null,"Gross Wall Area",{"$f":"M192+M85+M165","v":2425.0411111111116},"ft2",null,null,null,null,null,null,null,null,null,null,null,null,"Gross Wall Area",{"$f":"AB192+AB85+AB165","v":1314},"ft2"]
[null,null,null,null,null,null,null,null,null,null,null,"Area Weighted U-Value",null,{"$f":"IFERROR(N192/M192,\"\")","v":4.1999999999999996E-2},null,null,null,null,null,null,null,null,null,null,null,null,"Area Weighted U-Value",null,{"$f":"IFERROR(AC192/AB192,\"\")","v":5.6000000000000001E-2}]
[]
[]
[null,null,null,"Floor (over crawl or exterior)",null,null,null,null,null,null,null,null,null,null,null,null,null,null,"Floor (over crawl or exterior)"]
[null,null,null,"Plan","Component",null,"Floor",null,null,null,null,null,"Area","UA",null,null,null," ","Plan","Component",null,"Floor",null,null,null,null,null,"Area","UA"]
[null,null,null,"ID","Description","Ref.","U",null,null,null,null,null,null,null,null,null,null," ","ID","Description","Ref.","U"]
[null,null,null,null,"R38 vented Post/Beam (2021 1.2, 1.3; 2018 1.3-1.5)",{"$f":"IFERROR(VLOOKUP($E200,Table_FloorOverCrawlspace,2,FALSE),\"\")","v":"10-3"},{"$f":"IFERROR(VLOOKUP($E200,Table_FloorOverCrawlspace,3,FALSE),\"\")","v":2.4E-2},null,null,null,null,{"$f":"IF(AND(F200=\"NA\",M200<>\"\"), \"Error: Leave area blank\",\"\")","v":""},{"$f":"M173","v":1578},{"$f":"IFERROR(G200*M200,\"\")","v":37.872},{"$f":"IF(L200<>\"\",1,IF(F200=\"NA\",0,IF(AND(TRIM(E200)<>\"\",OR(ISNUMBER(M200)=FALSE,G200=\"\")),1,IF(AND(TRIM(E200)=\"\",G200=\"\",TRIM(M200)=\"\"),0,IF(AND(F200=\"Custom\",G200=0),1,IF(AND(G200<>\"\",N200=0),1,IF(AND(G200=\"\",M200>0),1,0)))))))","v":0},{"$f":"IF(F200=\"Custom\",IF(G200=0,\"U-value missing in Custom Input\",\"Refer to WSEC R402.1.5 U-factor Reference and Calculations\"),\"\")","v":""},null," ",null,null,{"$f":"IFERROR(VLOOKUP(T200,Table_FloorOverCrawlspace,2,FALSE),\"\")","v":""},{"$f":"IFERROR(VLOOKUP(T200,Table_FloorOverCrawlspace,3,FALSE),+\"\")","v":""},null,null,null,null,null,null,{"$f":"IFERROR(V200*AB200,\"\")","v":""},{"$f":"IF(AND(T200<>\"\",OR(ISNUMBER(AB200)=FALSE,V200=\"\")),1,IF(AND(T200=\"\",V200=\"\",AB200=\"\"),0,IF(AND(U200=\"Custom\",V200=0),1,IF(AND(V200<>\"\",AC200=0),1,IF(AND(V200=\"\",AB200>0),1,0)))))","v":0},{"$f":"IF(U200=\"Custom\",\"Refer to WSEC R402.1.5 U-factor Reference and Calculations\",\"\")","v":""}]
[null,null,null,null,null,{"$f":"IFERROR(VLOOKUP($E201,Table_FloorOverCrawlspace,2,FALSE),\"\")","v":""},{"$f":"IFERROR(VLOOKUP($E201,Table_FloorOverCrawlspace,3,FALSE),\"\")","v":""},null,null,null,null,"",null,{"$f":"IFERROR(G201*M201,\"\")","v":""},0,{"$f":"IF(F201=\"Custom\",IF(G201=0,\"U-value missing in Custom Input\",\"Refer to WSEC R402.1.5 U-factor Reference and Calculations\"),\"\")","v":""},null," ",null,null,{"$f":"IFERROR(VLOOKUP(T201,Table_FloorOverCrawlspace,2,FALSE),\"\")","v":""},{"$f":"IFERROR(VLOOKUP(T201,Table_FloorOverCrawlspace,3,FALSE),+\"\")","v":""},null,null,null,null,null,null,{"$f":"IFERROR(V201*AB201,\"\")","v":""},0,{"$f":"IF(U201=\"Custom\",\"Refer to WSEC R402.1.5 U-factor Reference and Calculations\",\"\")","v":""}]
[null,null,null,null," ",{"$f":"IFERROR(VLOOKUP($E202,Table_FloorOverCrawlspace,2,FALSE),\"\")","v":""},{"$f":"IFERROR(VLOOKUP($E202,Table_FloorOverCrawlspace,3,FALSE),\"\")","v":""},null,null,null,null,"",null,{"$f":"IFERROR(G202*M202,\"\")","v":""},0,{"$f":"IF(F202=\"Custom\",IF(G202=0,\"U-value missing in Custom Input\",\"Refer to WSEC R402.1.5 U-factor Reference and Calculations\"),\"\")","v":""},null," ",null,null,{"$f":"IFERROR(VLOOKUP(T202,Table_FloorOverCrawlspace,2,FALSE),\"\")","v":""},{"$f":"IFERROR(VLOOKUP(T202,Table_FloorOverCrawlspace,3,FALSE),+\"\")","v":""},null,null,null,null,null,null,{"$f":"IFERROR(V202*AB202,\"\")","v":""},0,{"$f":"IF(U202=\"Custom\",\"Refer to WSEC R402.1.5 U-factor Reference and Calculations\",\"\")","v":""}]
[null,null,null,null,null,{"$f":"IFERROR(VLOOKUP($E203,Table_FloorOverCrawlspace,2,FALSE),\"\")","v":""},{"$f":"IFERROR(VLOOKUP($E203,Table_FloorOverCrawlspace,3,FALSE),\"\")","v":""},null,null,null,null,"",null,{"$f":"IFERROR(G203*M203,\"\")","v":""},0,{"$f":"IF(F203=\"Custom\",IF(G203=0,\"U-value missing in Custom Input\",\"Refer to WSEC R402.1.5 U-factor Reference and Calculations\"),\"\")","v":""},null," ",null,null,{"$f":"IFERROR(VLOOKUP(T203,Table_FloorOverCrawlspace,2,FALSE),\"\")","v":""},{"$f":"IFERROR(VLOOKUP(T203,Table_FloorOverCrawlspace,3,FALSE),+\"\")","v":""},null,null,null,null,null,null,{"$f":"IFERROR(V203*AB203,\"\")","v":""},0,{"$f":"IF(U203=\"Custom\",\"Refer to WSEC R402.1.5 U-factor Reference and Calculations\",\"\")","v":""}]
[null,null,null,null,null,null,null,"Sum of Area and UA",null,null,null,null,{"$f":"IF(O204>0,\"\",SUM(M200:M203))","v":1578},{"$f":"IF(O204>0,\"Error\",SUM(N200:N203))","v":37.872},{"$f":"SUM(O200:O203)","v":0},{"$f":"ROW(P203)-ROW(P200)+1-COUNTBLANK(P200:P203)","v":0},null," ",null,null,null,null,"Sum of Area and UA",null,null,null,null,{"$f":"IF(AD204>0,\"\",SUM(AB200:AB203))","v":0},{"$f":"IF(AD204>0,\"Error\",SUM(AC200:AC203))","v":0},{"$f":"SUM(AD200:AD203)","v":0},{"$f":"ROW(AE203)-ROW(AE200)+1-COUNTBLANK(AE200:AE203)","v":0}]
[null,null,null,null,null,null,null,null,null,null,null,"Area Weighted U-Value",null,{"$f":"IFERROR(N204/M204,\"\")","v":2.4E-2},null,null,null,null,null,null,null,null,null,null,null,null,"Area Weighted U-Value",null,{"$f":"IFERROR(AC204/AB204,\"\")","v":""}]
[]
[]
[null,null,null,"Slab on Grade (less than 2 feet below grade)",null,null,null,null,null,null,null,null,null,null,null,null,null,null,"Slab on Grade (less than 2 feet below grade)"]
[null,null,null,"Plan","Component",null,"Slab",null,null,null,null,null,"Slab Perim",null,null,null,null,null,"Plan","Component",null,"Slab",null,null,null,null,null,"Slab Perim"]
[null,null,null,"ID","Description","Ref.","F",null,null,null,null,null,"Perimeter","FP",null,null,null,null,"ID","Description","Ref.","F",null,null,null,null,null,"Perimeter","FP"]
[null,null,null,null,null,{"$f":"IFERROR(VLOOKUP($E211,Table_SlabOnGrade,2,FALSE),\"\")","v":""},{"$f":"IFERROR(VLOOKUP($E211,Table_SlabOnGrade,3,FALSE),+\"\")","v":""},null,null,null,null,{"$f":"IF(AND(F211=\"NA\",M211<>\"\"), \"Error: Leave area blank\",\"\")","v":""},null,{"$f":"IFERROR(G211*M211,\"\")","v":""},{"$f":"IF(L211<>\"\",1,IF(F211=\"NA\",0,IF(AND(TRIM(E211)<>\"\",OR(ISNUMBER(M211)=FALSE,G211=\"\")),1,IF(AND(TRIM(E211)=\"\",G211=\"\",TRIM(M211)=\"\"),0,IF(AND(F211=\"Custom\",G211=0),1,IF(AND(G211<>\"\",N211=0),1,IF(AND(G211=\"\",M211>0),1,0)))))))","v":0},{"$f":"IF(F211=\"Custom\",IF(G211=0,\"U-value missing in Custom Input\",\"Refer to WSEC R402.1.5 U-factor Reference and Calculations\"),\"\")","v":""},null," ",null,"R10 2' horizontal w/TB (Code Baseline)",{"$f":"IFERROR(VLOOKUP(T211,Table_SlabOnGrade,2,FALSE),\"\")","v":"WSU"},{"$f":"IFERROR(VLOOKUP(T211,Table_SlabOnGrade,3,FALSE),+\"\")","v":0.54},null,null,null,null,null,139,{"$f":"IFERROR(V211*AB211,\"\")","v":75.06},{"$f":"IF(AND(T211<>\"\",OR(ISNUMBER(AB211)=FALSE,V211=\"\")),1,IF(AND(T211=\"\",V211=\"\",AB211=\"\"),0,IF(AND(U211=\"Custom\",V211=0),1,IF(AND(V211<>\"\",AC211=0),1,IF(AND(V211=\"\",AB211>0),1,0)))))","v":0},{"$f":"IF(U211=\"Custom\",\"Refer to WSEC R402.1.5 U-factor Reference and Calculations\",\"\")","v":""}]
[null,null,null,null,null,{"$f":"IFERROR(VLOOKUP($E212,Table_SlabOnGrade,2,FALSE),\"\")","v":""},{"$f":"IFERROR(VLOOKUP($E212,Table_SlabOnGrade,3,FALSE),\"\")","v":""},null,null,null,null,"",null,{"$f":"IFERROR(G212*M212,\"\")","v":""},0,"",null," ",null,null,{"$f":"IFERROR(VLOOKUP(T212,Table_SlabOnGrade,2,FALSE),\"\")","v":""},{"$f":"IFERROR(VLOOKUP(T212,Table_SlabOnGrade,3,FALSE),+\"\")","v":""},null,null,null,null,null,null,{"$f":"IFERROR(V212*AB212,\"\")","v":""},0,{"$f":"IF(U212=\"Custom\",\"Refer to WSEC R402.1.5 U-factor Reference and Calculations\",\"\")","v":""}]
[null,null,null,null,null,{"$f":"IFERROR(VLOOKUP($E213,Table_SlabOnGrade,2,FALSE),\"\")","v":""},{"$f":"IFERROR(VLOOKUP($E213,Table_SlabOnGrade,3,FALSE),+\"\")","v":""},null,null,null,null,"",null,{"$f":"IFERROR(G213*M213,\"\")","v":""},0,"",null," ",null,null,{"$f":"IFERROR(VLOOKUP(T213,Table_SlabOnGrade,2,FALSE),\"\")","v":""},{"$f":"IFERROR(VLOOKUP(T213,Table_SlabOnGrade,3,FALSE),+\"\")","v":""},null,null,null,null,null,null,{"$f":"IFERROR(V213*AB213,\"\")","v":""},0,{"$f":"IF(U213=\"Custom\",\"Refer to WSEC R402.1.5 U-factor Reference and Calculations\",\"\")","v":""}]
[null,null,null,null,null,{"$f":"IFERROR(VLOOKUP($E214,Table_SlabOnGrade,2,FALSE),\"\")","v":""},{"$f":"IFERROR(VLOOKUP($E214,Table_SlabOnGrade,3,FALSE),+\"\")","v":""},null,null,null,null,"",null,{"$f":"IFERROR(G214*M214,\"\")","v":""},0,"",null," ",null,null,{"$f":"IFERROR(VLOOKUP(T214,Table_SlabOnGrade,2,FALSE),\"\")","v":""},{"$f":"IFERROR(VLOOKUP(T214,Table_SlabOnGrade,3,FALSE),+\"\")","v":""},null,null,null,null,null,null,{"$f":"IFERROR(V214*AB214,\"\")","v":""},0,{"$f":"IF(U214=\"Custom\",\"Refer to WSEC R402.1.5 U-factor Reference and Calculations\",\"\")","v":""}]
[null,null,null,null,null,null,null,"Sum of Perimeter and FP",null,null,null,null,{"$f":"IF(O215>0,\"\",SUM(M211:M214))","v":0},{"$f":"IF(O215>0,\"Error\",SUM(N211:N214))","v":0},{"$f":"SUM(O211:O214)","v":0},{"$f":"ROW(P214)-ROW(P211)+1-COUNTBLANK(P211:P214)","v":0},null,null,null,null,null,null,"Sum of Perimeter and FP",null,null,null,null,{"$f":"IF(AD215>0,\"\",SUM(AB211:AB214))","v":139},{"$f":"IF(AD215>0,\"Error\",SUM(AC211:AC214))","v":75.06},{"$f":"SUM(AD211:AD214)","v":0},{"$f":"ROW(AE214)-ROW(AE211)+1-COUNTBLANK(AE211:AE214)","v":0}]
[null,null,null,null,null,null,null,null,null,null,null,"Area Weighted U-Value",null,{"$f":"IFERROR(N215/M215,\"\")","v":""},null,null,null,null,null,null,null,null,null,null,null,null,"Area Weighted U-Value",null,{"$f":"IFERROR(AC215/AB215,\"\")","v":0.54}]
[]
[]
[null,null,null,"Below Grade Walls and Slabs",null,null,null,null,null,null,null,null,null,null,null,null,null,null,"Below Grade Walls and Slabs"]
[null,null,null,"Plan","Component","Slab",null,"Wall ","Wall","Wall ","Slab",null,"Slab Perim","Slab",null,null,null,null,"Plan","Component","Slab",null,"Wall ","Wall","Wall ","Slab",null,"Slab","Slab"]
[null,null,null,"ID","Description","Depth","Ref.","U","Area","UA","F",null,"Perimeter","FP",null,null,null,null,"ID","Description","Depth","Ref.","U","Area","UA","F",null,"Perimeter","FP"]
[null,null,null,null,null,null,{"$f":"IFERROR('Group R'!H921,IFERROR(VLOOKUP($E222,Table_CustomBelowGradeSlab,2,FALSE),\"\"))","v":""},{"$f":"IFERROR('Group R'!I921,IFERROR(VLOOKUP($E222,Table_CustomBelowGradeSlab,5,FALSE),\"\"))","v":""},null,{"$f":"IFERROR(H222*I222,\"\")","v":""},{"$f":"IFERROR(J921,IFERROR(VLOOKUP($E222,Table_CustomBelowGradeSlab,6,FALSE),\"\"))","v":""},null,null,{"$f":"IFERROR(K222*M222,\"\")","v":""},{"$f":"IF(AND(TRIM(E222)<>\"\",OR(TRIM(I222)=\"\",TRIM(M222)=\"\")),1,IF(AND(TRIM(E222)=\"\",TRIM(I222)=\"\",TRIM(M222)=\"\"),0,IF(AND(G222=\"Custom\",H222=0),1,IF(AND(H222<>\"\",N222=0),1,IF(AND(H222=\"\",M222>0),1,0)))))","v":0},{"$f":"IF(G222=\"Custom\",IF(H222=0,\"U-value missing in Custom Input\",\"Refer to WSEC R402.1.5 U-factor Reference and Calculations\"),\"\")","v":""},null," ",null,null,null,{"$f":"IFERROR('Group R'!H928,IFERROR(VLOOKUP($E222,Table_CustomBelowGradeSlab,2,FALSE),\"\"))","v":""},{"$f":"IFERROR('Group R'!I928,IFERROR(VLOOKUP($E222,Table_CustomBelowGradeSlab,5,FALSE),\"\"))","v":""},null,{"$f":"IFERROR(W222*X222,\"\")","v":""},{"$f":"IFERROR('Group R'!J928,IFERROR(VLOOKUP($E222,Table_CustomBelowGradeSlab,6,FALSE),\"\"))","v":""},null,null,{"$f":"IFERROR(Z222*AB222,\"\")","v":""},{"$f":"IF(AND(T222<>\"\",W222=\"\"),1,IF(AND(T222=\"\",W222=\"\",AB222=\"\"),0,IF(AND(V222=\"Custom\",W222=0),1,IF(AND(W222<>\"\",AC222=0),1,IF(AND(W222=\"\",AB222>0),1,0)))))","v":0},{"$f":"IF(V222=\"Custom\",\"Refer to WSEC R402.1.5 U-factor Reference and Calculations\",\"\")","v":""}]
[null,null,null,null,null,null,{"$f":"IFERROR('Group R'!H922,IFERROR(VLOOKUP($E223,Table_CustomBelowGradeSlab,2,FALSE),\"\"))","v":""},{"$f":"IFERROR('Group R'!I922,IFERROR(VLOOKUP($E223,Table_CustomBelowGradeSlab,5,FALSE),\"\"))","v":""},null,{"$f":"IFERROR(H223*I223,\"\")","v":""},{"$f":"IFERROR('Group R'!J922,IFERROR(VLOOKUP($E223,Table_CustomBelowGradeSlab,6,FALSE),\"\"))","v":""},null,null,{"$f":"IFERROR(K223*M223,\"\")","v":""},{"$f":"IF(AND(TRIM(E223)<>\"\",OR(TRIM(I223)=\"\",TRIM(M223)=\"\")),1,IF(AND(TRIM(E223)=\"\",TRIM(I223)=\"\",TRIM(M223)=\"\"),0,IF(AND(G223=\"Custom\",H223=0),1,IF(AND(H223<>\"\",N223=0),1,IF(AND(H223=\"\",M223>0),1,0)))))","v":0},{"$f":"IF(G223=\"Custom\",IF(H223=0,\"U-value missing in Custom Input\",\"Refer to WSEC R402.1.5 U-factor Reference and Calculations\"),\"\")","v":""},null," ",null,null,null,{"$f":"IFERROR('Group R'!H929,IFERROR(VLOOKUP($E223,Table_CustomBelowGradeSlab,2,FALSE),\"\"))","v":""},{"$f":"IFERROR('Group R'!I929,IFERROR(VLOOKUP($E223,Table_CustomBelowGradeSlab,5,FALSE),\"\"))","v":""},null,{"$f":"IFERROR(W223*X223,\"\")","v":""},{"$f":"IFERROR('Group R'!J929,IFERROR(VLOOKUP($E223,Table_CustomBelowGradeSlab,6,FALSE),\"\"))","v":""},null,null,{"$f":"IFERROR(Z223*AB223,\"\")","v":""},{"$f":"IF(AND(T223<>\"\",W223=\"\"),1,IF(AND(T223=\"\",W223=\"\",AB223=\"\"),0,IF(AND(V223=\"Custom\",W223=0),1,IF(AND(W223<>\"\",AC223=0),1,IF(AND(W223=\"\",AB223>0),1,0)))))","v":0},{"$f":"IF(V223=\"Custom\",\"Refer to WSEC R402.1.5 U-factor Reference and Calculations\",\"\")","v":""}]
[null,null,null,null,null,null,{"$f":"IFERROR('Group R'!H923,IFERROR(VLOOKUP($E224,Table_CustomBelowGradeSlab,2,FALSE),\"\"))","v":""},{"$f":"IFERROR('Group R'!I923,IFERROR(VLOOKUP($E224,Table_CustomBelowGradeSlab,5,FALSE),\"\"))","v":""},null,{"$f":"IFERROR(H224*I224,\"\")","v":""},{"$f":"IFERROR('Group R'!J923,IFERROR(VLOOKUP($E224,Table_CustomBelowGradeSlab,6,FALSE),\"\"))","v":""},null,null,{"$f":"IFERROR(K224*M224,\"\")","v":""},0,{"$f":"IF(G224=\"Custom\",IF(H224=0,\"U-value missing in Custom Input\",\"Refer to WSEC R402.1.5 U-factor Reference and Calculations\"),\"\")","v":""},null," ",null,null,null,{"$f":"IFERROR('Group R'!H930,IFERROR(VLOOKUP($E224,Table_CustomBelowGradeSlab,2,FALSE),\"\"))","v":""},{"$f":"IFERROR('Group R'!I930,IFERROR(VLOOKUP($E224,Table_CustomBelowGradeSlab,5,FALSE),\"\"))","v":""},null,"",{"$f":"IFERROR('Group R'!J930,IFERROR(VLOOKUP($E224,Table_CustomBelowGradeSlab,6,FALSE),\"\"))","v":""},null,null,{"$f":"IFERROR(Z224*AB224,\"\")","v":""},{"$f":"IF(AND(T224<>\"\",W224=\"\"),1,IF(AND(T224=\"\",W224=\"\",AB224=\"\"),0,IF(AND(V224=\"Custom\",W224=0),1,IF(AND(W224<>\"\",AC224=0),1,IF(AND(W224=\"\",AB224>0),1,0)))))","v":0},{"$f":"IF(V224=\"Custom\",\"Refer to WSEC R402.1.5 U-factor Reference and Calculations\",\"\")","v":""}]
[null,null,null,null,null,null,{"$f":"IFERROR('Group R'!H924,IFERROR(VLOOKUP($E225,Table_CustomBelowGradeSlab,2,FALSE),\"\"))","v":""},{"$f":"IFERROR('Group R'!I924,IFERROR(VLOOKUP($E225,Table_CustomBelowGradeSlab,5,FALSE),\"\"))","v":""},null,{"$f":"IFERROR(H225*I225,\"\")","v":""},{"$f":"IFERROR('Group R'!J924,IFERROR(VLOOKUP($E225,Table_CustomBelowGradeSlab,6,FALSE),\"\"))","v":""},null,null,{"$f":"IFERROR(K225*M225,\"\")","v":""},0,{"$f":"IF(G225=\"Custom\",IF(H225=0,\"U-value missing in Custom Input\",\"Refer to WSEC R402.1.5 U-factor Reference and Calculations\"),\"\")","v":""},null," ",null,null,null,{"$f":"IFERROR('Group R'!H931,IFERROR(VLOOKUP($E225,Table_CustomBelowGradeSlab,2,FALSE),\"\"))","v":""},{"$f":"IFERROR('Group R'!I931,IFERROR(VLOOKUP($E225,Table_CustomBelowGradeSlab,5,FALSE),\"\"))","v":""},null,"",{"$f":"IFERROR('Group R'!J931,IFERROR(VLOOKUP($E225,Table_CustomBelowGradeSlab,6,FALSE),\"\"))","v":""},null,null,{"$f":"IFERROR(Z225*AB225,\"\")","v":""},{"$f":"IF(AND(T225<>\"\",W225=\"\"),1,IF(AND(T225=\"\",W225=\"\",AB225=\"\"),0,IF(AND(V225=\"Custom\",W225=0),1,IF(AND(W225<>\"\",AC225=0),1,IF(AND(W225=\"\",AB225>0),1,0)))))","v":0},{"$f":"IF(V225=\"Custom\",\"Refer to WSEC R402.1.5 U-factor Reference and Calculations\",\"\")","v":""}]
[null,null,null,null,null,null,null,"Sum of Area, Length and UA",{"$f":"IF(O226>0,\"\",SUM(I222:I225))","v":0},{"$f":"IF(O226>0,\"Error\",SUM(J222:J225))","v":0},null,null,{"$f":"IF($O226>0,\"\",SUM(M222:M225))","v":0},{"$f":"IF($O226>0,\"Error\",SUM(N222:N225))","v":0},{"$f":"SUM(O222:O225)","v":0},{"$f":"ROW(P225)-ROW(P222)+1-COUNTBLANK(P222:P225)","v":0},null,null,null,null,null,null,"Sum of Area, Length and UA",{"$f":"IF(AD226>0,\"\",SUM(X222:X225))","v":0},{"$f":"IF(AD226>0,\"Error\",SUM(Y222:Y225))","v":0},null,null,{"$f":"IF($O226>0,\"\",SUM(AB222:AB225))","v":0},{"$f":"IF($O226>0,\"Error\",SUM(AC222:AC225))","v":0},{"$f":"SUM(AD222:AD225)","v":0},{"$f":"ROW(AE225)-ROW(AE222)+1-COUNTBLANK(AE222:AE225)","v":0}]
[null,null,null,null,null,null,null,"Weighted U- and F-values",null,{"$f":"IFERROR(J226/I226,\"\")","v":""},null,null,null,{"$f":"IFERROR(N226/M226,\"\")","v":""},null,null,null,null,null,null,null,null,"Weighted U- and F-values",null,{"$f":"IFERROR(Y226/X226,\"\")","v":""},null,null,null,{"$f":"IFERROR(AC226/AB226,\"\")","v":""}]
[null,null,null,null,null,null,null,"Effective F-value",{"$f":"IFERROR((J226+N226)/M226,\"\")","v":""}]
[]
[null,null,null,"Links to Download Forms, Checklists and Other Resources",null,null,"Link"]
[null,null,null,null,"Compliance Certificate",null,"Compliance Certificate",null,"Instructions"]
[null,null,null,null,"Insulation Certificate for Residential New Construction",null,"Insulation Certificate"]
[null,null,null,null,"Duct Testing Affadavits"]
[null,null,null,null,null,"Existing Construction","Affidavit, Existing"]
[null,null,null,null,null,"New Construction","Affidavit, New"]
[null,null,null,null,"Prescriptive Checklist for 2018 WSEC",null,"Prescriptive Checklist"]
[null,null,null,null,"Alterations (Remodel) Worksheet",null,"Worksheet"]
[null,null,null,null,"EER SEER2 COP HSPF2 Converter",null,"https://www.adicotengineering.com/eer-seer2-cop-hspf2-kwton-converter"]
[]
[]
[null,"Show Ventilation Calculator?",null,null,null,"Show"]
[null,null,"Ventilation Requirements"]
[null,null,null,null,"Conditioned Floor Area",{"$f":"H66","v":2100},"sq. ft."]
[null,null,null,null,"Number of Bedrooms ",3]
[null,null,null,null,"Run-Time Percent in Each 4-Hour Segment",1]
[null,null,null,null,"Is the system Balanced?","Balanced",null,{"$f":"IF(F246=\"Balanced\", \"Verify system meets definition of 'Balanced Whole-House Ventilation'\",\"\")","v":"Verify system meets definition of 'Balanced Whole-House Ventilation'"}]
[null,null,null,null,"Is the system Distributed?","Not Distributed",null,{"$f":"IF(F247=\"Distributed\", \"Verify system meets definition of 'Distributed Whole-House Ventilation'\",\"\")","v":""}]
[null,null,null,null,"Ventilation Code Section",{"$f":"CONCATENATE(F797,\", \",F798)","v":"IRC, Chapter 15"}]
[null,null,null,null,"Whole House Mechanical Ventilation Airflow Rate",{"$f":"IFERROR('Group R'!F799,\"\")","v":68.75},"CFM"]
[]
[]
[null,"Show Distribution System Calculator?",null,null,null,"Show"]
[null,null,"HVAC Thermal Distribution System",null,null,null,null,"Download RS-33 (2018)","http://www.energy.wsu.edu/Documents/Duct%20Testing%20Standards%20_2018%20WSEC.pdf"]
[null,null,null,"Is this a hydronic heating system?",null,null,"No"]
[null,null,null,{"$f":"IF(Menu_HydronicHeatingSystem=\"Yes\",\"Location of Hydronic Distribution System, including HW Storage Tank\",\"Location of Ducts\")","v":"Location of Ducts"},null,null,"Unconditioned Space",null,null,null,{"$f":"IF(Menu_DuctLocation=\"\",\"Select location from drop down\",CONCATENATE(H904,G904))","v":""}]
[null,null,null,{"$f":"IF(Menu_HydronicHeatingSystem=\"No\",\"Location of Air Handler\",\"Location of Boiler or Heat Pump Evaporator Coil\")","v":"Location of Air Handler"},null,null,"Unconditioned Space",null,null,null,{"$f":"IF(Menu_AirHandlerLocation=\"\",\"Select location from drop down\",CONCATENATE(H906,G906))","v":""}]
[null,null,null,"For Existing Construction:  Are Any of These Exceptions True?"]
[null,null,null,"Are ducts systems documented to have been previously sealed as confirmed through field verification and diagnostic testing per RS-33?",null,null,"No"]
[null,null,null,"Is there less than 40 linear feet in unconditioned spaces? (not excepted under WSEC 2021)",null,null,"No",{"$f":"IF(AND(G259=\"No\",Menu_DuctLocation=\"Conditioned Space\"),\"Inconsistent with input above:  Ducts located in conditioned space.\",\"-\")","v":"-"}]
[null,null,null,"Are existing duct systems constructed, insulated or sealed with asbestos?",null,null,"No"]
[null,null,null,"Is the project an Addition less than 750 sf of conditioned floor area?",null,null,"No"]
[null,null,null,null,null,"Is Duct Testing Required?",{"$f":"F879","v":"Yes"}]
[]
[null,null,null,"Maximum Duct Leakage:",null,null,{"$f":"IF(F897=\"Yes\",\"Option 4.1 Buried Ducts is Selected\",\"\")","v":""}]
[null,null,null,"Is this a post-contruction test?",null,null,"Yes"]
[null,null,null,"Is the air handler installed?",null,null,"No"]
[null,null,null,null,null,"Maximum total measured duct leakage per square foot",{"$f":"F894","v":0.04},"CFM25 per sq. ft."]
[null,null,null,null,null,"Maximum allowable total measured duct leakage",{"$f":"G267*H66","v":84},"CFM25"]
[null,null,null,{"$f":"IF(G255=MenuItem_ConditionedSpace,\"A maximum of 10 feet of return ducts and 5 feet of supply ducts are allowed to be located outside of the building thermal envelope, if insulated and sealed per R403.3.7.\",\"\")","v":""}]
[]
[null,"Show Heating System Sizing?",null,null,null,"Show"]
[null,null,"Heating System Sizing - Proposed Design",null,null,null,null,"Try Out BetterBuiltNW's HVAC Sizing Tool:","https://betterbuiltnw.com/resources/hvac-sizing-tool",null,null,null,null,null,null,null,null,null,"Heating System Sizing - Existing Baseline"]
[null,null,null,null,"Nearest Weather Station","Vancouver",null,null,null,{"$f":"IF(OR(F275=\"\",F276=\"\"),\"ERROR: Select a weather site near your location from drop down\",\"\")","v":""},null,null,null,null,null,null,null,null,null,"Nearest Weather Station",{"$f":"IF(F273=\"\",\"\",F273)","v":"Vancouver"}]
[null,null,null,null,"Indoor Design Temperature",70,"F",null,null,null,null,null,null,null,null,null,null,null,null,"Indoor Design Temperature",70,"F"]
[null,null,null,null,"Outdoor Design Temperature",{"$f":"IFERROR(VLOOKUP(F273,Table_Weather,2,FALSE),\"\")","v":22},"F",null,null,null,null,null,null,null,null,null,null,null,null,"Outdoor Design Temperature",{"$f":"IFERROR(VLOOKUP(F273,Table_Weather,2,FALSE),\"\")","v":22},"F"]
[null,null,null,null,"Design Temperature Difference (∆T)",{"$f":"IFERROR(F274-F275,\"\")","v":48},"F",null,null,null,null,null,null,null,null,null,null,null,null,"Design Temperature Difference (∆T)",{"$f":"IFERROR(U274-U275,\"\")","v":48},"F"]
[]
[null,null,null,null,{"$f":"G66","v":"Conditioned Floor Area, Proposed Design"},{"$f":"H66","v":2100},"ft2",null,null,null,null,null,null,null,null,null,null,null,null,"Conditioned Floor Area",{"$f":"U66","v":2216},"ft2"]
[null,null,null,null,"Conditioned Volume",null,"ft3",{"$f":"IFERROR(IF(F281>10,CONCATENATE(\"Ave ceiling = \",ROUND(F281,1),\" ft. Check: Higher than expected conditioned volume\"),IF(OR(F279=0,F279=\"\"),CONCATENATE(\"Volume assuming ceiling height of 8.5 ft  = \",F278*8.5,\" ft3\"),CONCATENATE(\"Average ceiling height =\", ROUND(F281,1),\" ft. Volume = \",ROUND($F664,0), \" ft3\"))),\"Input Error\")","v":"Volume assuming ceiling height of 8.5 ft  = 17850 ft3"},null,null,null,null,null,null,{"$f":"IFERROR(IF(P279=1,\"Volume smaller than expected\",\"\"), \"Error\")","v":""},{"$f":"IF(AND(F279<>\" \",F279<>\"\"),IF(F664/F278<7,1,0),0)","v":0},null,null,null,"Conditioned Volume",null,"ft3",{"$f":"IFERROR(IF(U281>10,CONCATENATE(\"Ave ceiling = \",ROUND(U281,1),\" ft. Check: Higher than expected conditioned volume\"),IF(OR(U279=0,U279=\"\"),CONCATENATE(\"Volume assuming ceiling height of 8.5 ft  = \",U278*8.5,\" ft3\"),CONCATENATE(\"Average ceiling height =\", ROUND(U281,1),\" ft. Volume = \",ROUND($F665,0), \" ft3\"))),\"Input Error\")","v":"Volume assuming ceiling height of 8.5 ft  = 18836 ft3"}]
[null,null,null,null,"Leave blank to use default of 8.5 ft. ceiling height",null,null,null,null,null,null,null,null,null,null,null,null,null,null,"Leave blank to use default of 8.5 ft. ceiling height"]
[null,null,null,null,"Average ceiling height",{"$f":"IFERROR(IF(OR(F279=\"\",F278=0),8.5,F279/F278),8.5)","v":8.5},"ft",null,null,null,null,null,null,null,null,null,null,null,null,"Average ceiling height",{"$f":"IFERROR(IF(OR(U279=\"\",U278=0),8.5,U279/U278),8.5)","v":8.5},"ft"]
[]
[null,null,null,null,"HVAC System Type","Heat Pump",null,null,null,null,null,null,null,null,null,null,null,null,null,"System Type","All Other Systems (not heat pump)"]
[null,null,null,null,"Location of HVAC Distribution System",{"$f":"G255","v":"Unconditioned Space"},null,null,null,null,null,null,null,null,null,null,null,null,null,"Location of Ducts","Unconditioned Space"]
[]
[null,null,null,null,{"$f":"IF(Menu_UseOfCalculator=E329,\"Sum of UA, including exempt door and window\",\"Sum of UA\")","v":"Sum of UA"},{"$f":"F671","v":234.15589333333332},null,null,null,null,null,null,null,null,null,null,null,null,null,"Sum of UA",{"$f":"H39","v":273.93641333333335}]
[]
[null,null,null,null,"Envelope Heat Load",{"$f":"IFERROR(F286*F276,\"\")","v":11239.48288},"Btu / Hour",null,null,null,null,null,null,null,null,null,null,null,null,"Envelope Heat Load",{"$f":"IFERROR(U286*U276,\"\")","v":13148.947840000001},"Btu / Hour"]
[null,null,null,null,"Sum of UA X ∆T",null,null,null,null,null,null,null,null,null,null,null,null,null,null,"Sum of UA X ∆T"]
[null,null,null,null,"Air Leakage Heat Load",{"$f":"IFERROR($F664*0.6*F276*0.018,F278*F281*0.6*F276*0.018)","v":9253.4399999999987},"Btu / Hour",null,null,null,null,null,null,null,null,null,null,null,null,"Air Leakage Heat Load",{"$f":"IFERROR($F665*0.6*U276*0.018,U278*U281*0.6*U276*0.018)","v":9764.5823999999993},"Btu / Hour"]
[null,null,null,null,"((Volume X  0.6) X ∆T) X .018))",null,null,null,null,null,null,null,null,null,null,null,null,null,null,"((Volume X  0.6) X ∆T) X .018))"]
[null,null,null,null,"Building Design Heat Load",{"$f":"IFERROR(F288+F290,\"\")","v":20492.922879999998},"Btu / Hour",null,null,null,null,null,null,null,null,null,null,null,null,"Building Design Heat Load",{"$f":"IFERROR(U288+U290,\"\")","v":22913.53024},"Btu / Hour"]
[null,null,null,null,"Air Leakage + Envelope Heat Loss",null,null,null,null,null,null,null,null,null,null,null,null,null,null,"Air Leakage + Envelope Heat Loss"]
[null,null,null,null,"Building and Duct Heat Load",{"$f":"IFERROR(F292*F678,\"\")","v":22542.215167999999},"Btu / Hour",null,null,null,null,null,null,null,null,null,null,null,null,"Building and Duct Heat Load",{"$f":"IFERROR(U292*F679,\"\")","v":25204.883264000004},"Btu / Hour"]
[null,null,null,null,"For ducts located in unconditioned space: Sum of Building Heat Loss X 1.1",null,null,null,null,null,null,null,null,null,null,null,null,null,null,"For ducts located in unconditioned space: Sum of Building Heat Loss X 1.1"]
[null,null,null,null,"For ducts located in conditioned space or ductless: Sum of Building Heat Loss X 1",null,null,null,null,null,null,null,null,null,null,null,null,null,null,"For ducts located in conditioned space or ductless: Sum of Building Heat Loss X 1"]
[null,null,null,null,"Maximum Heat Equipment Output",{"$f":"IFERROR(IF(P279<>1,IFERROR(F294*I677,\"Error\"),\"Error\"),\"Error\")","v":28177.768959999998},"Btu / Hour",null,null,null,null,null,null,null,null,null,null,null,null,"Maximum Heat Equipment Output",{"$f":"IFERROR(U294*I678,\"Error\")","v":35286.836569600004},"Btu / Hour"]
[null,null,null,null,"Building and Duct Heat Loss X 1.25 for heat pumps",{"$f":"IFERROR(F297/3412,\"Error\")","v":8.2584316998827667},"kW",null,null,null,null,null,null,null,null,null,null,null,null,"Building and Duct Heat Loss X 1.25 for heat pumps",{"$f":"IFERROR(U297/3412,\"Error\")","v":10.341980237280188},"kW"]
[null,null,null,null,"Building and Duct Heat Loss X 1.40 for all other systems",null,null,null,null,null,null,null,null,null,null,null,null,null,null,"Building and Duct Heat Loss X 1.40 for all other systems"]
[null,null,"UA Summary"]
[null,null,null,null,"UA envelope",{"$f":"IFERROR(F288/F$276,\"\")","v":234.15589333333332},"Btu / Hour/ deg F"]
[null,null,null,null,"UA envelope+infiltration",{"$f":"IFERROR(F292/F$276,\"\")","v":426.9358933333333},"Btu / Hour/ deg F"]
[null,null,null,null,"UA envelope+infiltration+duct loss",{"$f":"IFERROR(F294/F$276,\"\")","v":469.62948266666666},"Btu / Hour/ deg F"]
[]
[]
[]
[]
[]
[]
[]
[]
[]
[]
[]
[]
[]
[]
[]
[]
[]
[]
[]
[]
[]
[]
[null,null,null,null,1,{"$f":"E326+1","v":2},3,4,5,6,7,null,null,null,null,null,null,null,null,null,null,null,null,null,null,null,null,null,null,null,null,null,{"$f":"I329","v":{"$error":"#VALUE!"}}]
[null,null,null,null,"DropDown_UseOfCalculator, Table_UseOfCalculator","Baseline Msg","Table 406.3 Row Action","Show baseline UA calculator - Column Action"," Results Message 1","Baseline","About Your Selection"]
[null,null,null,1]
[null,null,null,{"$f":"D328+1","v":2},"U-Factor Compliance Path",{"$f":"IF(F$377=\"Yes\",\"Maximum baseline window area is 15% of floor area per Option 1 UA % reduction calculation (Section R402.1.5).\",\"Baseline and proposed window areas are equal.\")","v":"Maximum baseline window area is 15% of floor area per Option 1 UA % reduction calculation (Section R402.1.5)."},"Show","Hide",{"$f":"IF(G365<>\"\",G365,IF(AND(N39>0,H39>0,AND(N39<=H39,N40>=Section_EnergyCreditResults),SUM(O65:O226)=0),\"UA Qualifies. Please check for complete Component Descriptions\",\"Proposed design does not meet prescriptive path requirements.\"))","v":{"$error":"#VALUE!"}},{"$f":"F$635","v":"Code Baseline"},{"$f":"IF(F$377=\"Yes\",\"No exempt window or door areas\", \"Up to 15 sf exempt window and 24 sf exempt door allowable\")","v":"No exempt window or door areas"}]
[null,null,null,{"$f":"D329+1","v":3},"Total UA Alternative, Whole Building Trade Off Analysis","Maximum baseline window area is 15% of floor area.","Show","Hide",{"$f":"IF(G$365<>\"\",G$365,IF(N$39<H$39,\"Proposed design has lower (better) UA than baseline\",\"Proposed design has higher (worse) UA than baseline.\"))","v":"Proposed design has lower (better) UA than baseline"},{"$f":"F$635","v":"Code Baseline"},"No exempt window or door areas"]
[null,null,null,4,"User-Defined Baseline (Addition/Remodel/Alteration of Existing)",{"$f":"IF(F$377=\"Yes\",\"Maximum baseline window area is 15% of floor area per Option 1 UA % reduction calculation (Section R402.1.5).\",\"Baseline and proposed window areas are equal.\")","v":"Maximum baseline window area is 15% of floor area per Option 1 UA % reduction calculation (Section R402.1.5)."},"Show","Show",{"$f":"IF(G$365<>\"\",G$365,IF(N$39<H$39,\"Proposed design has lower (better) UA than baseline\",\"Proposed design has higher (worse) UA than baseline.\"))","v":"Proposed design has lower (better) UA than baseline"},{"$f":"G635","v":"Existing Baseline"},{"$f":"CONCATENATE(IF(F$377=\"Yes\",\"No exempt window or door areas. \", \"Up to 15 sf exempt window and 24 sf exempt door allowable. \"), \"Enter baseline design details to right of proposed design below\")","v":"No exempt window or door areas. Enter baseline design details to right of proposed design below"}]
[null,null,null,5,"R-value Alternative / Prescriptive Path (Tables 406.2 & 406.3 Only)",null,"Show","Hide",null,null,"Floor area (entered below) and project type determine classification.  No UA calc required."]
[null,null,null,6,"Non-Dwelling Unit (Total UA)","-","Hide All","Hide",null,null,"No credits required. Exempt window and door areas ok."]
[null,null,null,null,"Selected Switches",{"$f":"VLOOKUP(Menu_UseOfCalculator,Table_UseOfCalculator,F326, FALSE)","v":"Maximum baseline window area is 15% of floor area."},{"$f":"VLOOKUP(Menu_UseOfCalculator,Table_UseOfCalculator,3, FALSE)","v":"Show"},{"$f":"VLOOKUP(Menu_UseOfCalculator,Table_UseOfCalculator,4, FALSE)","v":"Hide"},{"$f":"IF(AND(Menu_UseOfCalculator=MenuItem_UserDefinedBaseline,Menu_ProjectType<>\"New Construction\"),\" compared to user-defined baseline UA. Check required % reduction compared to Addition's UA.\",IFERROR(IF(G365<>\"\",\"\",IF(N$39<H$39,CONCATENATE(\", Proposed UA is better than baseline by \",ROUND(N$42*100,0),\"%\"),CONCATENATE(\". Proposed UA exceeds (i.e. is worse than) that of baseline by \",-ROUND(N$42*100,0),\"%\"))),\"\"))","v":", Proposed UA is better than baseline by 15%"}]
[null,null,null,null,null,null,null,"Message",{"$f":"IF(I334<>\"\",IF(N43>=0,CONCATENATE(\"UA Reduction = \",ROUND(N43,2)),CONCATENATE(\"UA Reduction = \",ROUND(N43,2),\" is negative\")),\"Correct errors below\")","v":"UA Reduction = 39.78"}]
[]
[null,null,null,null,"Determine PASS/FAIL ",null,null,null,"Test"]
[null,null,null,null,null,null,null,null,"Baseline Pass/Fail - Does envelope meet baseline",{"$f":"IF(Menu_UseOfCalculator=Item_Use_CompleteForms,\"\",IF(AND(Menu_UseOfCalculator=MenuItem_UserDefinedBaseline,Menu_ProjectType<>\"New Construction\"),\" -\",IFERROR(IF(G365<>\"\",\"\",IF(N$39<H$39,\"PASS\",\"FAIL\")),\"\")))","v":"PASS"},{"$f":"IF(OR(J338=\"PASS\",J338=\"\"),0,1)","v":0}]
[null,null,null,null,null,null,null,null,{"$f":"F788","v":"Option 1 Target UA Pass/Fail"},{"$f":"IFERROR(IF(Menu_UseOfCalculator=Item_Use_CompleteForms,\"\",G788),\"\")","v":"PASS"},{"$f":"IF(OR(J339=\"PASS\",J339=\"\"),0,1)","v":0}]
[null,null,null,null,null,null,null,null,"Option 1.1 Window Pass/Fail",{"$f":"G789","v":"PASS"},{"$f":"IF(OR(J340=\"PASS\",J340=\"\"),0,1)","v":0}]
[null,null,null,null,null,null,null,null,"Required Credits Met",{"$f":"IF(Menu_UseOfCalculator=MenuItem_NonDwellingUnit,\"PASS\",IF(N40>=H40,\"PASS\",\"FAIL\"))","v":"PASS"},{"$f":"IF(OR(J341=\"PASS\",J341=\"\"),0,1)","v":0}]
[null,null,null,null,null,null,null,null,"U-Factor path test",{"$f":"IF(Menu_UseOfCalculator=MenuItem_UFactorPath,IF(SUM(J29:J37)>0,\"FAIL\",\"PASS\"),\"\")","v":""},{"$f":"IF(OR(J342=\"PASS\",J342=\"\"),0,1)","v":0}]
[null,null,null,null,null,null,null,null,"Selected Pass/Fail",{"$f":"IF(SUM(K338:K342)>0,\"FAIL\",\"PASS\")","v":"PASS"}]
[]
[null,null,null,null,"Does WSEC-R 2021 have exempt windows and doors?",{"$f":"K400","v":"WSEC 2021"},"Yes"]
[null,null,null,null,"Does WSEC-R 2018 have exempt windows and doors?",{"$f":"K401","v":"WSEC 2018"},"Yes"]
[null,null,null,null,"For non-dwelling unit, show exempt areas?",null,"Yes"]
[null,null,null,null,"Show Exempt Door and Window Input?","Switch",{"$f":"IF(F382=\"No\",\"Hide\",\"Show\")","v":"Hide"},"3/19/2024 change: Exempt doors and windows are not allowed if Option 1 % UA reduction is selected because Option 1 refers to Section on Total UA Alternative.  Even Option 1 UA trade offs should follow rules of Total UA Alternative"]
[null,null,null,null,"Show WSEC 2021 or 2018 options?","Switch",{"$f":"IF(Menu_CodeVersion=\"WSEC 2018\",2018,2021)","v":2021}]
[null,null,null,null,"Hide Inputs Except for Forms?","Switch",{"$f":"IF(Menu_UseOfCalculator=Item_Use_CompleteForms,\"Hide\",\"Show\")","v":"Show"}]
[]
[null,null,null,null,"Check custom entries meassage","Custom Entries"]
[null,null,null,null,"Doors",{"$f":"P85","v":0},{"$f":"IF(F353>0,CONCATENATE(\"- \",E353),\"\")","v":""},null,"DropDown_RowAction",null,null,null,"DropDown_HideShow",null,"DropDown_YesNo"]
[null,null,null,null,"Overhead Glazing",{"$f":"P97","v":0},{"$f":"IF(F354>0,CONCATENATE(\"- \",E354),\"\")","v":""}]
[null,null,null,null,"Vertical Glazing",{"$f":"P165","v":0},"",null,"Hide All",null,null,null,"Hide",null,"Yes"]
[null,null,null,null,"Flat/Vaulted Ceilings",{"$f":"P177","v":0},"",null,"Hide 2-6",null,null,null,"Show",null,"No"]
[null,null,null,null,"Wall (above grade)",{"$f":"P192","v":0},"",null,"Show"]
[null,null,null,null,"Floors",{"$f":"P204","v":0},""]
[null,null,null,null,"Slab on Grade",{"$f":"P215","v":0},""]
[null,null,null,null,"Below Grade Wall",{"$f":"P226","v":0},""]
[null,null,null,null,"Check custom entries meassage",{"$f":"CONCATENATE(G353,G354,G355,G356,G357,G358,G359,G360)","v":""},{"$f":"IF(F361=\"\",\"\",CONCATENATE(\"Review required for custom entries: \",G353,G354,G355,G356,G357,G358,G359,G360))","v":""}]
[null,null,null,null,"Check Baseline meassage"]
[null,null,null,null,"Check Baseline Design",{"$f":"IF(Menu_UseOfCalculator=MenuItem_UserDefinedBaseline,\"Include\",\"\")","v":""},{"$f":"IF(F363=\"\",\"\",\"Review of Baseline Required - \")","v":""}]
[null,null,null,null,"Combined Message",{"$f":"CONCATENATE(G353,G354,G355,G356,G357,G358,G359,G360)","v":""},{"$f":"IF(AND(G361=\"\",G363=\"\"),\"\",CONCATENATE(\"Note: \",G363,\" \",G361,\" \",I41,))","v":""}]
[null,null,null,null,"Missing Data Message",null,{"$f":"IF(SUBTOTAL(109,O75:O226)=0,\"\",\"Correct Missing Inputs or Errors Below\")","v":""}]
[]
[null,null,null,null,"Option 1 selections.  Is there a maximum glazing percent in the baseline per Section R402.1.5"]
[]
[null,null,null,null,"Selection: ",{"$f":"Menu_Option1","v":"Option 1.2"}]
[null,null,null,null,null,{"$f":"MenuItem_WSEC2018","v":"WSEC 2018"},{"$f":"K400","v":"WSEC 2021"}]
[null,null,null,null,null,1,1]
[null,null,null,null,null,{"$f":"H430","v":"Option 1.3"},{"$f":"H412","v":"Option 1.2"}]
[null,null,null,null,null,{"$f":"H431","v":"Option 1.4"},{"$f":"H413","v":"Option 1.3"}]
[null,null,null,null,null,{"$f":"H432","v":"Option 1.5"},{"$f":"H414","v":"Option 1.4"}]
[null,null,null,null,null,{"$f":"H433","v":"Option 1.6"}]
[null,null,null,null,null,{"$f":"IFERROR(VLOOKUP($F$369,F372:F375,F371,FALSE),\"No\")","v":"No"},{"$f":"IFERROR(VLOOKUP($F$369,G372:G374,G371,FALSE),\"No\")","v":"Option 1.2"}]
[null,null,null,null,"Is maximum glazing percent in baseline?",{"$f":"IF(Menu_UseOfCalculator=MenuItem_NonDwellingUnit,\"No\",IF(Menu_UseOfCalculator=MenuItem_TotalUA,\"Yes\", IF(AND(F376=\"No\",Menu_CodeVersion=MenuItem_WSEC2018),\"No\",IF(AND(Menu_CodeVersion=K400,G376=\"No\"),\"No\",\"Yes\"))))","v":"Yes"},"Exclude any option that does not reference Section R402.1.5"]
[]
[null,null,null,null,"Is exempt area in code version?",{"$f":"IF(Menu_CodeVersion=K400,G345,G346)","v":"Yes"}]
[null,null,null,null,"Is UA percent trade off selected",{"$f":"F377","v":"Yes"}]
[]
[null,null,null,null,"Is exempt door and window area allowed? ",{"$f":"IF(AND(F379=\"Yes\",F380=\"No\"),\"Yes\",\"No\")","v":"No"}]
[]
[]
[null,null,null,null,"Required Credits"]
[null,null,null,null,"Target energy credits"]
[null,null,null,null,"DropDown_ProjectType",null,null,null,null,null,"WSEC 2021","WSEC 2021","WSEC 2018","WSEC 2018"]
[null,null,null,null,null,"Message_FloorArea",null,null,null,null,{"$f":"$N401","v":"R3 Single family dwellings and townhouses"},{"$f":"$N400","v":"R2 Multifamily"},{"$f":"$N401","v":"R3 Single family dwellings and townhouses"},{"$f":"$N400","v":"R2 Multifamily"}]
[null,null,null,null,"New Construction","Conditioned Floor Area"," ",null,null,"Column Search String",{"$f":"CONCATENATE(K387,K388)","v":"WSEC 2021R3 Single family dwellings and townhouses"},{"$f":"CONCATENATE(L387,L388)","v":"WSEC 2021R2 Multifamily"},{"$f":"CONCATENATE(M387,M388)","v":"WSEC 2018R3 Single family dwellings and townhouses"},{"$f":"CONCATENATE(N387,N388)","v":"WSEC 2018R2 Multifamily"},null,1]
[null,null,null,null,"Addition","Conditioned Floor Area of Addition"," ",null,null,"Small Dwelling Unit",5,6.5,3,4.5,1,{"$f":"P389+1","v":2}]
[null,null,null,null,"Addition / Remodel / Alteration","Conditioned Floor Area"," ",null,null,"Medium Dwelling Unit",8,6.5,6,4.5,2,{"$f":"P390+1","v":3}]
[null,null,null,null,"Selected",{"$f":"VLOOKUP(Menu_ProjectType,E389:F391,2,FALSE)","v":"Conditioned Floor Area"}," ",null,null,"Large Dwelling Unit",9,6.5,7,4.5,3,{"$f":"P391+1","v":4}]
[null,null,null,null,null,null,null,null,null,{"$f":"IF(F401=K400,\"Addition 150 sf to 500 sf\",\"Addition of 500 sf or less\")","v":"Addition 150 sf to 500 sf"},{"$f":"IF($H$66<150,0,2)","v":2},6.5,1.5,4.5,4,{"$f":"P392+1","v":5}]
[null,null,null,"Taken off menu above","Addition & Alteration (Exception R502.1.1.1)","Conditioned Floor Area of Addition",null,null,null,1,{"$f":"J394+1","v":2},{"$f":"K394+1","v":3},{"$f":"L394+1","v":4},{"$f":"M394+1","v":5},null,{"$f":"P393+1","v":6}]
[]
[null,null,null,null,"Occupancy Type",{"$f":"F19","v":"R3 Single family dwellings and townhouses"}]
[null,null,null,null,"Project Type",{"$f":"F18","v":"New Construction"}]
[null,null,null,null,"Floor Area",{"$f":"H66","v":2100},{"$f":"IF(OR(F397=Item_ProjectType_Addition,F397=Item_ProjectType_RemodelAlteration),IF(AND(F401=K400,F398<150),\"Exempt Addition\",\"--\"),\"--\")","v":"--"},null,null,null,"DropDown_CodeVersion",null,null,"DropDown_Occupancy"]
[null,null,null,null,"Window Area",{"$f":"M165","v":132.25}]
[null,null,null,null,"Classification",{"$f":"IF(Menu_UseOfCalculator=MenuItem_NonDwellingUnit,\"Non-Dwelling Unit\",IF(AND(F398<=500,OR(F397=Item_ProjectType_Addition,F397=Item_ProjectType_RemodelAlteration)),J393,IF(OR(AND(F398<1500,F399<300),AND(F397=Item_ProjectType_Addition,F398>500,F398<1500,F399<300)),J390,IF(F398>5000,J392,J391))))","v":"Medium Dwelling Unit"},null,null,null,null,"WSEC 2021",null,null,"R2 Multifamily"]
[null,null,null,null,"Code version",{"$f":"F20","v":"WSEC 2021"},null,null,null,null,"WSEC 2018",null,null,"R3 Single family dwellings and townhouses"]
[null,null,null,null,"Column",{"$f":"HLOOKUP(CONCATENATE(F401,F396),Table_ColumnEnergyCredits,$P$394,FALSE)","v":2}]
[null,null,null,null,"Required credits",{"$f":"IF(Menu_UseOfCalculator=MenuItem_NonDwellingUnit,0,VLOOKUP(F400,Table_EnergyCredits,F402,FALSE))","v":8}]
[null,null,null,null,"Medium dwelling unit message for SF<1500",{"$f":"IF(AND(F398<1500,F399>300,F400<>J393),\"Classified as medium dwelling unit (not small dwelling unit) because fenestration area is 300 sf or greater.\",\"-\")","v":"-"}]
[null,null,null,null,null,"Option Definitions"]
[]
[null,null,null,null,null,null,null,"Option 1.1",{"$f":"IFERROR(VLOOKUP(H407,Table_Option_1_Selected,2,TRUE),0)","v":0.5}]
[null,null,null,"Selected",{"$f":"F20","v":"WSEC 2021"},null,null,"DropDown_Option_1","Credits","Desc"]
[null,null,null,"Selected",{"$f":"F19","v":"R3 Single family dwellings and townhouses"},null,null,null,null,"-"]
[null,null,null,"R3/R2 Column",{"$f":"IF(E409=N400,3,2)","v":2},null,"Search","Not Selected",null,"-"]
[null,null,null,null,null,null,{"$f":"CONCATENATE($E$408,\" \",H411)","v":"WSEC 2021 Option 1.1"},{"$f":"IF(E$408=K$400,H421,H428)","v":"Option 1.1"},{"$f":"IFERROR(VLOOKUP($G411,Table_Option1,$E$410,FALSE),\"\")","v":0.5},{"$f":"IFERROR(VLOOKUP($G411,Table_Option1,$L$436,FALSE),\"\")","v":"Prescriptive compliance based on Table R402.1.3 Vertical Fenestration = U 0.22 "}]
[null,null,null,null,null,null,"WSEC 2021 Option 1.2","Option 1.2",1,"Perscriptive compliance per Table 402.1.3 / U-0.25 vertical fenestration / R-38 floors or R-10 perimeter & fully insulated slab. Or 15% reduction in UA per section R402.1.5"]
[null,null,null,null,null,null,"WSEC 2021 Option 1.3","Option 1.3",1.5,"Perscriptive compliance based on Table 402.1.3 / U-0.18 vertical fenestration / R-21+12ci walls / R-60 adv ceiling / R-38 floors or R-10 perimeter & fully insulated slab. Or 22.5% reduction in UA per section R402.1.5"]
[null,null,null,null,null,null,"WSEC 2021 Option 1.4","Option 1.4",2.5,"Prescriptive compliance based on Table R402.1.3 / U-0.18 vertical fenestration / R-21+R16ci walls / R-60 adv ceiling / R-48 floors / R-20 perimeter & fully insulated above & below-grade slabs / R-21+R-16ci basement walls  Or 30% reduction in UA"]
[null,null,null,null,null,null,"WSEC 2021 0",0,"",""]
[null,null,null,null,null,null,"WSEC 2021 0",0,"",""]
[null,null,null,null,null,null,"WSEC 2021 0",0,"",""]
[null,null,null,null,null,null,"WSEC 2021 0",{"$f":"IF(E$408=K$400,H427,H435)","v":0},"",""]
[]
[null,null,null,null,null,null,"Option Data",null,"Search","R3 Single Family","R2 Multifamily","Select Desc","R3 Desc","R2 Desc"]
[null,null,null,null,"Option 1",1,{"$f":"$K$400","v":"WSEC 2021"},"Option 1.1",{"$f":"CONCATENATE($G$421,\" \",H421)","v":"WSEC 2021 Option 1.1"},0.5,0.5,{"$f":"IF($F$19=$N$401,M421,N421)","v":"Prescriptive compliance based on Table R402.1.3 Vertical Fenestration = U 0.22 "},"Prescriptive compliance based on Table R402.1.3 Vertical Fenestration = U 0.22 ","Prescriptive compliance based on Table R402.1.3 Vertical Fenestration = U 0.22 "]
[null,null,null,null,null,{"$f":"F421+1","v":2},null,"Option 1.2",{"$f":"CONCATENATE($G$421,\" \",H422)","v":"WSEC 2021 Option 1.2"},1,1,{"$f":"IF($F$19=$N$401,M422,N422)","v":"Perscriptive compliance per Table 402.1.3 / U-0.25 vertical fenestration / R-38 floors or R-10 perimeter & fully insulated slab. Or 15% reduction in UA per section R402.1.5"},"Perscriptive compliance per Table 402.1.3 / U-0.25 vertical fenestration / R-38 floors or R-10 perimeter & fully insulated slab. Or 15% reduction in UA per section R402.1.5","Perscriptive compliance per Table 402.1.3 / U-0.25 vertical fenestration / R-38 floors or R-10 perimeter & fully insulated slab. Or 15% reduction in UA per section R402.1.5"]
[null,null,null,null,null,{"$f":"F422+1","v":3},null,"Option 1.3",{"$f":"CONCATENATE($G$421,\" \",H423)","v":"WSEC 2021 Option 1.3"},1.5,1.5,{"$f":"IF($F$19=$N$401,M423,N423)","v":"Perscriptive compliance based on Table 402.1.3 / U-0.18 vertical fenestration / R-21+12ci walls / R-60 adv ceiling / R-38 floors or R-10 perimeter & fully insulated slab. Or 22.5% reduction in UA per section R402.1.5"},"Perscriptive compliance based on Table 402.1.3 / U-0.18 vertical fenestration / R-21+12ci walls / R-60 adv ceiling / R-38 floors or R-10 perimeter & fully insulated slab. Or 22.5% reduction in UA per section R402.1.5","Perscriptive compliance based on Table 402.1.3 / U-0.18 vertical fenestration / R-21+12ci walls / R-60 adv ceiling / R-38 floors or R-10 perimeter & fully insulated slab. Or 22.5% reduction in UA per section R402.1.5"]
[null,null,null,null,null,4,null,"Option 1.4",{"$f":"CONCATENATE($G$421,\" \",H424)","v":"WSEC 2021 Option 1.4"},2.5,2,{"$f":"IF($F$19=$N$401,M424,N424)","v":"Prescriptive compliance based on Table R402.1.3 / U-0.18 vertical fenestration / R-21+R16ci walls / R-60 adv ceiling / R-48 floors / R-20 perimeter & fully insulated above & below-grade slabs / R-21+R-16ci basement walls  Or 30% reduction in UA"},"Prescriptive compliance based on Table R402.1.3 / U-0.18 vertical fenestration / R-21+R16ci walls / R-60 adv ceiling / R-48 floors / R-20 perimeter & fully insulated above & below-grade slabs / R-21+R-16ci basement walls  Or 30% reduction in UA","Prescriptive compliance based on Table R402.1.3 / U-0.18 vertical fenestration / R-21+R16ci walls / R-60 adv ceiling / R-48 floors / R-20 perimeter & fully insulated above & below-grade slabs / R-21+R-16ci basement walls  Or 30% reduction in UA"]
[null,null,null,null,null,5,"Blank",0]
[null,null,null,null,null,6,"Blank",0]
[null,null,null,null,null,7,"Blank",0]
[null,null,null,null,null,8,{"$f":"$K$401","v":"WSEC 2018"},"Option 1.1",{"$f":"CONCATENATE($G$428,\" \",H428)","v":"WSEC 2018 Option 1.1"},0.5,0.5,{"$f":"IF($F$19=$N$401,M428,N428)","v":"U 0.24 Windows"},"U 0.24 Windows","U 0.24 Windows"]
[null,null,null,null,null,9,null,"Option 1.2","WSEC 2018 Option 1.2",1,1,"U 0.20 Windows","U 0.20 Windows","U 0.20 Windows"]
[null,null,null,null,null,10,null,"Option 1.3","WSEC 2018 Option 1.3",0.5,"NA","U 0.28 Windows / R-38 floors or R-10 Fully insulated slab. Or 5% reduction in UA","U 0.28 Windows / R-38 floors or R-10 Fully insulated slab. Or 5% reduction in UA","U 0.28 Windows / R-38 floors or R-10 Fully insulated slab. Or 5% reduction in UA"]
[null,null,null,null,null,11,null,"Option 1.4","WSEC 2018 Option 1.4",1,1,"U-0.25 Windows / R-21+R4ci walls / R-21+R5ci below-grade walls / R-38 floors or R-10 Fully insulated slab.  Or 15% reduction in UA","U-0.25 Windows / R-21+R4ci walls / R-21+R5ci below-grade walls / R-38 floors or R-10 Fully insulated slab.  Or 15% reduction in UA","U-0.25 Windows / R-21+R4ci walls / R-21+R5ci below-grade walls / R-38 floors or R-10 Fully insulated slab.  Or 15% reduction in UA"]
[null,null,null,null,null,12,null,"Option 1.5","WSEC 2018 Option 1.5",2,1.5,"U-0.22 Windows / R-21+R12ci walls / R-49 adv ceiling / R-38 floors / R-10 Fully insulated above-grade and below-grade slabs / R-21+R-12 ci basement walls  Or 30% reduction in UA","U-0.22 Windows / R-21+R12ci walls / R-49 adv ceiling / R-38 floors / R-10 Fully insulated above-grade and below-grade slabs / R-21+R-12 ci basement walls  Or 30% reduction in UA","U-0.22 Windows / R-21+R12ci walls / R-49 adv ceiling / R-38 floors / R-10 Fully insulated above-grade and below-grade slabs / R-21+R-12 ci basement walls  Or 30% reduction in UA"]
[null,null,null,null,null,13,null,"Option 1.6","WSEC 2018 Option 1.6",3,2,"U-0.18 Windows / R-21+R16ci walls / R-60 adv ceiling & single rafter or joist vaulted  / R-48 floors / R-20 Fully insulated above-grade and below-grade slabs.  Or 40% reduction in UA","U-0.18 Windows / R-21+R16ci walls / R-60 adv ceiling & single rafter or joist vaulted  / R-48 floors / R-20 Fully insulated above-grade and below-grade slabs.  Or 40% reduction in UA","U-0.18 Windows / R-21+R16ci walls / R-60 adv ceiling & single rafter or joist vaulted  / R-48 floors / R-20 Fully insulated above-grade and below-grade slabs.  Or 40% reduction in UA"]
[null,null,null,null,null,14,null,"Option 1.7","WSEC 2018 Option 1.7",0.5,0.5,"U 0.28 Windows / R-49 advanced ceiling below vented attic / R-49 advanced vaulted ceiling","U 0.28 Windows / R-49 advanced ceiling below vented attic / R-49 advanced vaulted ceiling","U 0.28 Windows / R-49 advanced ceiling below vented attic / R-49 advanced vaulted ceiling"]
[null,null,null,null,null,15,"Blank"]
[null,null,null,null,null,null,null,1,null,2,3,4]
[]
[]
[]
[null,null,null,null,"Option 2",null,null,"Option 2.1"]
[null,null,null,null,null,null,null,"DropDown_Option_2","Credits","Desc"]
[null,null,null,null,null,null,"Selected Menu",null,null,"-"]
[null,null,null,null,null,null,"Search","Not Selected",0]
[null,null,null,null,null,null,{"$f":"CONCATENATE($E$408,\" \",H444)","v":"WSEC 2021 Option 2.1"},{"$f":"IF($E$408=$K$400,H450,H454)","v":"Option 2.1"},{"$f":"IFERROR(VLOOKUP($G444,Table_Option2,$E$410,FALSE),\"\")","v":1},{"$f":"IFERROR(VLOOKUP($G444,Table_Option2,$L$436,FALSE),\"\")","v":"Per Section R402.4.1.2 / 2.0 ACH50 / For R-2, 0.25 cfm per ft2 at 50 Pa. /  HRV with min SHR eff of 0.65 per IRC Section M1505.3 or IMC Section 403.8"}]
[null,null,null,null,null,null,{"$f":"CONCATENATE($E$408,\" \",H445)","v":"WSEC 2021 Option 2.2"},{"$f":"IF($E$408=$K$400,H451,H455)","v":"Option 2.2"},{"$f":"IFERROR(VLOOKUP($G445,Table_Option2,$E$410,FALSE),\"\")","v":1.5},{"$f":"IFERROR(VLOOKUP($G445,Table_Option2,$L$436,FALSE),\"\")","v":"Per Section R402.4.1.2 /1.5 ACH50 / For R-2, 0.20 cfm per ft2 at 50 Pa. /  HRV with min SHR eff of 0.75 per IRC Section M1505.3 or IMC Section 403.8"}]
[null,null,null,null,null,null,"WSEC 2021 Option 2.3",{"$f":"IF($E$408=$K$400,H452,H456)","v":"Option 2.3"},{"$f":"IFERROR(VLOOKUP($G446,Table_Option2,$E$410,FALSE),\"\")","v":2},{"$f":"IFERROR(VLOOKUP($G446,Table_Option2,$L$436,FALSE),\"\")","v":"Per Section R402.4.1.2 0.6ACH50 / For R-2, 0.15 cfm per ft2 at 50 Pa. /  HRV with min SHR eff of 0.80 per IRC Section M1505.3 or IMC Section 403.8"}]
[null,null,null,null,null,null,"WSEC 2021 0",{"$f":"IF($E$408=$K$400,H453,H457)","v":0},{"$f":"IFERROR(VLOOKUP($G447,Table_Option2,$E$410,FALSE),\"\")","v":""},{"$f":"IFERROR(VLOOKUP($G447,Table_Option2,$L$436,FALSE),\"\")","v":""}]
[]
[null,null,null,null,null,null,"Option Data",null,null,"R3","R2","Select Desc","R3 Desc","R2 Desc"]
[null,null,null,null,null,1,{"$f":"$K$400","v":"WSEC 2021"},"Option 2.1",{"$f":"CONCATENATE($G$450,\" \",H450)","v":"WSEC 2021 Option 2.1"},1,1,{"$f":"IF($F$19=$N$401,M450,N450)","v":"Per Section R402.4.1.2 / 2.0 ACH50 / For R-2, 0.25 cfm per ft2 at 50 Pa. /  HRV with min SHR eff of 0.65 per IRC Section M1505.3 or IMC Section 403.8"},"Per Section R402.4.1.2 / 2.0 ACH50 / For R-2, 0.25 cfm per ft2 at 50 Pa. /  HRV with min SHR eff of 0.65 per IRC Section M1505.3 or IMC Section 403.8","Compliance based on Section R402.4.1.2: Reduce the tested air leakage to 2.0 ACH max at 50 Pa, or for R-2, optional compliance based on Section R402.4.1.2: Reduce the tested air leakage to 0.25 cfm/ft2 max at 50 Pa and All whole house ventilation requirements per IRC M1505.3 or IMC 403.8."]
[null,null,null,null,null,{"$f":"F450+1","v":2},null,"Option 2.2",{"$f":"CONCATENATE($G$450,\" \",H451)","v":"WSEC 2021 Option 2.2"},1.5,1.5,{"$f":"IF($F$19=$N$401,M451,N451)","v":"Per Section R402.4.1.2 /1.5 ACH50 / For R-2, 0.20 cfm per ft2 at 50 Pa. /  HRV with min SHR eff of 0.75 per IRC Section M1505.3 or IMC Section 403.8"},"Per Section R402.4.1.2 /1.5 ACH50 / For R-2, 0.20 cfm per ft2 at 50 Pa. /  HRV with min SHR eff of 0.75 per IRC Section M1505.3 or IMC Section 403.8","Per Section R402.4.1.2 /1.5 ACH50 / For R-2, 0.20 cfm per ft2 at 50 Pa. /  HRV with min SHR eff of 0.75 per IRC Section M1505.3 or IMC Section 403.8"]
[null,null,null,null,null,{"$f":"F451+1","v":3},null,"Option 2.3",{"$f":"CONCATENATE($G$450,\" \",H452)","v":"WSEC 2021 Option 2.3"},2,2,{"$f":"IF($F$19=$N$401,M452,N452)","v":"Per Section R402.4.1.2 0.6ACH50 / For R-2, 0.15 cfm per ft2 at 50 Pa. /  HRV with min SHR eff of 0.80 per IRC Section M1505.3 or IMC Section 403.8"},"Per Section R402.4.1.2 0.6ACH50 / For R-2, 0.15 cfm per ft2 at 50 Pa. /  HRV with min SHR eff of 0.80 per IRC Section M1505.3 or IMC Section 403.8","Per Section R402.4.1.2 0.6ACH50 / For R-2, 0.15 cfm per ft2 at 50 Pa. /  HRV with min SHR eff of 0.80 per IRC Section M1505.3 or IMC Section 403.8"]
[null,null,null,null,null,4,"Blank",0]
[null,null,null,null,null,5,{"$f":"$K$401","v":"WSEC 2018"},"Option 2.1",{"$f":"CONCATENATE($G$454,\" \",H454)","v":"WSEC 2018 Option 2.1"},0.5,1,{"$f":"IF($F$19=$N$401,M454,N454)","v":"3.0 ACH50 / High efficiency fans / For R-2, 0.3 cfm per ft2 at 50 Pa. / High efficiency fans"},"3.0 ACH50 / High efficiency fans / For R-2, 0.3 cfm per ft2 at 50 Pa. / High efficiency fans","3.0 ACH50 / High efficiency fans / For R-2, 0.3 cfm per ft2 at 50 Pa. / High efficiency fans"]
[null,null,null,null,null,6,null,"Option 2.2",{"$f":"CONCATENATE($G$454,\" \",H455)","v":"WSEC 2018 Option 2.2"},1,1.5,{"$f":"IF($F$19=$N$401,M455,N455)","v":"2.0 ACH50 / Heat Recovery Ventilation min eff 65%  / For R2, 0.25 cfm per ft2 at 50 Pa / HRV with min SHR eff of 0.65"},"2.0 ACH50 / Heat Recovery Ventilation min eff 65%  / For R2, 0.25 cfm per ft2 at 50 Pa / HRV with min SHR eff of 0.65","2.0 ACH50 / Heat Recovery Ventilation min eff 65%  / For R2, 0.25 cfm per ft2 at 50 Pa / HRV with min SHR eff of 0.65"]
[null,null,null,null,null,7,null,"Option 2.3",{"$f":"CONCATENATE($G$454,\" \",H456)","v":"WSEC 2018 Option 2.3"},1.5,2,{"$f":"IF($F$19=$N$401,M456,N456)","v":"1.5 ACH50 / Heat Recovery Ventilation min eff 75% / For R2, 0.25 cfm per ft2 at 50 Pa  / HRV with min SHR eff of 0.75"},"1.5 ACH50 / Heat Recovery Ventilation min eff 75% / For R2, 0.25 cfm per ft2 at 50 Pa  / HRV with min SHR eff of 0.75","1.5 ACH50 / Heat Recovery Ventilation min eff 75% / For R2, 0.25 cfm per ft2 at 50 Pa  / HRV with min SHR eff of 0.75"]
[null,null,null,null,null,8,null,"Option 2.4",{"$f":"CONCATENATE($G$454,\" \",H457)","v":"WSEC 2018 Option 2.4"},2,2.5,{"$f":"IF($F$19=$N$401,M457,N457)","v":"0.6 ACH50 / Heat Recovery Ventilation min eff 80% / For R2, 0.15 cfm per ft2 at 50 Pa  / HRV with min SHR eff of 0.75"},"0.6 ACH50 / Heat Recovery Ventilation min eff 80% / For R2, 0.15 cfm per ft2 at 50 Pa  / HRV with min SHR eff of 0.75","0.6 ACH50 / Heat Recovery Ventilation min eff 80% / For R2, 0.15 cfm per ft2 at 50 Pa  / HRV with min SHR eff of 0.75"]
[]
[]
[null,null,null,null,"Option 3",null,null,"Option 3.1",{"$f":"IFERROR(VLOOKUP(H460,Table_Option_1_Selected,2,TRUE),0)","v":2.5}]
[null,null,null,null,null,null,null,"DropDown_Option_3","Credits","Desc"]
[null,null,null,null,null,null,"Selected Menu"]
[null,null,null,null,null,null,null,"Not Selected",0,"-"]
[null,null,null,null,null,null,{"$f":"CONCATENATE($E$408,\" \",H464)","v":"WSEC 2021 Option 3.1"},{"$f":"IF($E$408=$K$400,H476,H487)","v":"Option 3.1"},{"$f":"IFERROR(VLOOKUP($G464,Table_Option3,$E$410,FALSE),\"\")","v":1},{"$f":"IFERROR(VLOOKUP($G464,Table_Option3,4,FALSE),\"\")","v":"System Type 1 Table R406.2 Energy Star rated gas or propane (U.S. North) Min AFUE 95% for furnace or 90% for boiler)"}]
[null,null,null,null,null,null,{"$f":"CONCATENATE($E$408,\" \",H465)","v":"WSEC 2021 Option 3.2"},"Option 3.2",0.5,"System Type 2 Table R406.2 Energy Star Rated gas or propane (U.S.North supplemental heat for heat pump (Min AFUE 95% for furnace or 90% for boiler)"]
[null,null,null,null,null,null,"WSEC 2021 Option 3.3","Option 3.3",0.5,"Air Source centrally ducted Heat Pump  Min HSPF2 of 8.1 (HSPF of 9.5), in areas where winter design temp. is 23° F or less, a NEEP or ASHP cold climate unit shall be installed."]
[null,null,null,null,null,null,"WSEC 2021 Option 3.4","Option 3.4",1.5,"Closed-loop ground source or open loop water source Heat Pump. Min COP 3.3 for GSHP or 3.6 for WSHP.w/ Max 150 Ft. Hydraulic Head. "]
[null,null,null,null,null,null,"WSEC 2021 Option 3.5","Option 3.5",1.5,"Ductless Mini Split Heat Pump W/ Zonal Control. Min HSPF2 of 9 (HSPF of 10) installed in largest zone of the home and primary heat is Zonal Elec Resist Heat"]
[null,null,null,null,null,null,"WSEC 2021 Option 3.6","Option 3.6",1,"Air source ducted Heat Pump w/ Min HSPF2 of 9.4 (HSPF of 11).  A ducted cold climate variable capacity heat pump on the NEEP qualified product list with a min HSPF2 of 8.5 (HSPF of 10) may be used to satisfy this requirement.  If htg design temp is 23F or below,a cold climate variable capacity heat pump is required."]
[null,null,null,null,null,null,"WSEC 2021 Option 3.7","Option 3.7",{"$f":"IFERROR(VLOOKUP($G470,Table_Option3,$E$410,FALSE),\"\")","v":2},"Ductless Split System with no electric resistance in primary living areas.  HSPF2, of 9 (HSPF of 10), except HSPF2 of 8.1 (HSPF of 9) if heating load is 24000 BTUs or less."]
[null,null,null,null,null,null,"WSEC 2021 Option 3.8","Option 3.8",1,"Air-to-water heat pump with minimum COP of 3.2 @47° F or lessrated per AHRI 550/590."]
[null,null,null,null,null,null,"WSEC 2021 Option 3.9",{"$f":"IF($E$408=$K$400,H484,H494)","v":"Option 3.9"},1.5,"Gas fired Heat Pumps meeting ANSI Z21.40.2 & Z21.40.4 or CSA w/ Min UEF of 1.15"]
[null,null,null,null,null,null,{"$f":"CONCATENATE($E$408,\" \",H473)","v":"WSEC 2021 Option 3.10"},{"$f":"IF($E$408=$K$400,H485,H496)","v":"Option 3.10"},2.5,"Combination water and space heating requires Tier 2 NEEA  Advanced gas fired HP water heater Version 1.0"]
[]
[null,null,null,null,null,null,"Option Data",null,null,"R3","R2","Select Desc","R3 Desc","R2 Desc"]
[null,null,null,null,null,1,{"$f":"$K$400","v":"WSEC 2021"},"Option 3.1",{"$f":"CONCATENATE($G$476,\" \",H476)","v":"WSEC 2021 Option 3.1"},1,1,{"$f":"IF($F$19=$N$401,M476,N476)","v":"System Type 1 Table R406.2 Energy Star rated gas or propane (U.S. North) Min AFUE 95% for furnace or 90% for boiler)"},"System Type 1 Table R406.2 Energy Star rated gas or propane (U.S. North) Min AFUE 95% for furnace or 90% for boiler)","System Type 1 Table R406.2 Energy Star rated gas or propane (U.S. North) Min AFUE 95% for furnace or 90% for boiler)"]
[null,null,null,null,null,{"$f":"F476+1","v":2},null,"Option 3.2",{"$f":"CONCATENATE($G$476,\" \",H477)","v":"WSEC 2021 Option 3.2"},0.5,0.5,"System Type 2 Table R406.2 Energy Star Rated gas or propane (U.S.North supplemental heat for heat pump (Min AFUE 95% for furnace or 90% for boiler)","System Type 2 Table R406.2 Energy Star Rated gas or propane (U.S.North supplemental heat for heat pump (Min AFUE 95% for furnace or 90% for boiler)","System Type 2 Table R406.2 Energy Star Rated gas or propane (U.S.North supplemental heat for heat pump (Min AFUE 95% for furnace or 90% for boiler)"]
[null,null,null,null,null,{"$f":"F477+1","v":3},null,"Option 3.3","WSEC 2021 Option 3.3",0.5,"NA","Air Source centrally ducted Heat Pump  Min HSPF2 of 8.1 (HSPF of 9.5), in areas where winter design temp. is 23° F or less, a NEEP or ASHP cold climate unit shall be installed.","Air Source centrally ducted Heat Pump  Min HSPF2 of 8.1 (HSPF of 9.5), in areas where winter design temp. is 23° F or less, a NEEP or ASHP cold climate unit shall be installed.","NA"]
[null,null,null,null,null,4,null,"Option 3.4","WSEC 2021 Option 3.4",1.5,1,"Closed-loop ground source or open loop water source Heat Pump. Min COP 3.3 for GSHP or 3.6 for WSHP.w/ Max 150 Ft. Hydraulic Head. ","Closed-loop ground source or open loop water source Heat Pump. Min COP 3.3 for GSHP or 3.6 for WSHP.w/ Max 150 Ft. Hydraulic Head. ","Closed-loop ground source or open loop water source Heat Pump. Min COP 3.3 for GSHP or 3.6 for WSHP.w/ Max 150 Ft. Hydraulic Head. "]
[null,null,null,null,null,5,null,"Option 3.5","WSEC 2021 Option 3.5",1.5,2,"Ductless Mini Split Heat Pump W/ Zonal Control. Min HSPF2 of 9 (HSPF of 10) installed in largest zone of the home and primary heat is Zonal Elec Resist Heat","Ductless Mini Split Heat Pump W/ Zonal Control. Min HSPF2 of 9 (HSPF of 10) installed in largest zone of the home and primary heat is Zonal Elec Resist Heat","Ductless Mini Split Heat Pump W/ Zonal Control. HSPF2 of 9 (HSPF of 10) installed in largest zone of the home and primary heat is Zonal Elec Resist Heat"]
[null,null,null,null,"Qualified product list",6,null,"Option 3.6","WSEC 2021 Option 3.6",1,"NA","Air source ducted Heat Pump w/ Min HSPF2 of 9.4 (HSPF of 11).  A ducted cold climate variable capacity heat pump on the NEEP qualified product list with a min HSPF2 of 8.5 (HSPF of 10) may be used to satisfy this requirement.  If htg design temp is 23F or below,a cold climate variable capacity heat pump is required.","Air source ducted Heat Pump w/ Min HSPF2 of 9.4 (HSPF of 11).  A ducted cold climate variable capacity heat pump on the NEEP qualified product list with a min HSPF2 of 8.5 (HSPF of 10) may be used to satisfy this requirement.  If htg design temp is 23F or below,a cold climate variable capacity heat pump is required.","Air source ducted Heat Pump w/ Min HSPF2 of 9.4 (HSPF of 11).  A ducted cold climate variable capacity heat pump on the NEEP qualified product list with a min HSPF2 of 8.5 (HSPF of 10) may be used to satisfy this requirement.  If htg design temp is 23F or below,a cold climate variable capacity heat pump is required."]
[null,null,null,null,null,7,null,"Option 3.7","WSEC 2021 Option 3.7",2,3,"Ductless Split System with no electric resistance in primary living areas.  HSPF2, of 9 (HSPF of 10), except HSPF2 of 8.1 (HSPF of 9) if heating load is 24000 BTUs or less.","Ductless Split System with no electric resistance in primary living areas.  HSPF2, of 9 (HSPF of 10), except HSPF2 of 8.1 (HSPF of 9) if heating load is 24000 BTUs or less.","Ductless Split System with no electric resistance in primary living areas.  HSPF2, of 9 (HSPF of 10), except HSPF2 of 8.1 (HSPF of 9) if heating load is 24000 BTUs or less."]
[null,null,null,null,null,8,null,"Option 3.8","WSEC 2021 Option 3.8",1,"NA","Air-to-water heat pump with minimum COP of 3.2 @47° F or lessrated per AHRI 550/590.","Air-to-water heat pump with minimum COP of 3.2 @47° F or lessrated per AHRI 550/590.","Air-to-water heat pump with minimum COP of 3.2 @47° F or lessrated per AHRI 550/590."]
[null,null,null,null,null,9,null,"Option 3.9","WSEC 2021 Option 3.9",1.5,1.5,"Gas fired Heat Pumps meeting ANSI Z21.40.2 & Z21.40.4 or CSA w/ Min UEF of 1.15","Gas fired Heat Pumps meeting ANSI Z21.40.2 & Z21.40.4 or CSA w/ Min UEF of 1.15","Gas fired Heat Pumps meeting ANSI Z21.40.2 & Z21.40.4 or CSA w/ Min UEF of 1.15"]
[null,null,null,null,null,10,null,"Option 3.10","WSEC 2021 Option 3.10",2.5,2.5,"Combination water and space heating requires Tier 2 NEEA  Advanced gas fired HP water heater Version 1.0","Combination water and space heating requires Tier 2 NEEA  Advanced gas fired HP water heater Version 1.0","Combination water and space heating requires Tier 2 NEEA  Advanced gas fired HP water heater Version 1.0"]
[null,null,null,null,"Option 3.11 is below.",11,null,"-","-"]
[null,null,null,null,null,1,{"$f":"$K$401","v":"WSEC 2018"},"Option 3.1",{"$f":"CONCATENATE($G$487,\" \",H487)","v":"WSEC 2018 Option 3.1"},1,1,{"$f":"IF($F$19=$N$401,M487,N487)","v":"High Efficiency Fossil fuel-fired furnace or boiler as primary heating system (Min AFUE 95% for furnace or 90% for boiler)"},"High Efficiency Fossil fuel-fired furnace or boiler as primary heating system (Min AFUE 95% for furnace or 90% for boiler)","High Efficiency Fossil fuel-fired furnace or boiler as primary heating system (Min AFUE 95% for furnace or 90% for boiler)"]
[null,null,null,null,null,2,null,"Option 3.2",{"$f":"CONCATENATE($G$487,\" \",H488)","v":"WSEC 2018 Option 3.2"},1,"NA","Heat Pump:  Air Source with min HSPF of 9.5","Heat Pump:  Air Source with min HSPF of 9.5","Heat Pump:  Air Source with min HSPF of 9.5"]
[null,null,null,null,null,3,null,"Option 3.3","WSEC 2018 Option 3.3",1.5,1,"Heat Pump: Closed-loop ground source or open loop water source. Min COP 3.3 for GSHP or 3.6 for WSHP. ","Heat Pump: Closed-loop ground source or open loop water source. Min COP 3.3 for GSHP or 3.6 for WSHP. ","Heat Pump: Closed-loop ground source or open loop water source. Min COP 3.3 for GSHP or 3.6 for WSHP. "]
[null,null,null,null,null,4,null,"Option 3.4","WSEC 2018 Option 3.4",1.5,2,"Ductless Split System, Zonal Control. Min HSPF of 10. Or Zonal Elec Resist Heat<=2kW","Ductless Split System, Zonal Control. Min HSPF of 10. Or Zonal Elec Resist Heat<=2kW","Ductless Split System, Zonal Control. Min HSPF of 10. Or Zonal Elec Resist Heat<=2kW"]
[null,null,null,null,null,5,null,"Option 3.5.1","WSEC 2018 Option 3.5.1",1.5,"NA","Central Heat Pump:  Air Source with min HSPF of 11","Central Heat Pump:  Air Source with min HSPF of 11","Central Heat Pump:  Air Source with min HSPF of 11"]
[null,null,null,null,null,6,null,"Option 3.5.2","WSEC 2018 Option 3.5.2",1.5,"NA","Central Heat Pump: Air source variable speed w/ min HSPF of 10, plus any one of: (1) NEEP cold climate, (2) Reduce UA by 22% and no Option 1 already selected, (3) Option 5.5 unitary Tier IV HPWH, (4) Option 7.1 if not already selected, dryer CEF>=3.93","Central Heat Pump: Air source variable speed w/ min HSPF of 10, plus any one of: (1) NEEP cold climate, (2) Reduce UA by 22% and no Option 1 already selected, (3) Option 5.5 unitary Tier IV HPWH, (4) Option 7.1 if not already selected, dryer CEF>=3.93","Central Heat Pump: Air source variable speed w/ min HSPF of 10, plus any one of: (1) NEEP cold climate, (2) Reduce UA by 22% and no Option 1 already selected, (3) Option 5.5 unitary Tier IV HPWH, (4) Option 7.1 if not already selected, dryer CEF>=3.93"]
[null,null,null,null,null,7,null,"Option 3.6","WSEC 2018 Option 3.6",2,3,"Ductless Split System with no electric resistance in primary living areas","Ductless Split System with no electric resistance in primary living areas","Ductless Split System with no electric resistance in primary living areas"]
[null,null,null,null,null,8,"Blank","-",null,0,0]
[null,null,null,null,null,9,"Blank","-",null,0,0]
[null,null,null,null,null,10,"Blank","-",null,0,0]
[null,null,null,null,null,11]
[]
[]
[null,null,null,null,"Is this a Ductless System?",null,null,"Enter Ductless Systems"]
[null,null,null,null,null,{"$f":"MenuSelection_Option3","v":"Option 3.7"},{"$f":"$K$400","v":"WSEC 2021"},"Option 3.5","Option 3.7",{"$f":"IF(OR(MenuSelection_Option3=I501,MenuSelection_Option3=H501),1,0)","v":1}]
[null,null,null,null,null,null,{"$f":"$K$401","v":"WSEC 2018"},"Option 3.4","Option 3.6",{"$f":"IF(OR(MenuSelection_Option3=I502,MenuSelection_Option3=H502),1,0)","v":0}]
[null,null,null,null,null,null,null,null,"Is Ductless?",{"$f":"IF(Menu_CodeVersion=G501,J501,J502)","v":1},"1=Y"]
[]
[null,null,null,null,null,null,null,"Option 3,11",{"$f":"IFERROR(VLOOKUP(H505,Table_Option_4_Selected,2,TRUE),)","v":0}]
[null,null,null,null,null,null,null,"DropDown_Option_4"]
[null,null,null,null,null,null,"Selected Menu",null,null,"-"]
[null,null,null,null,null,null,null,"Not Selected",0]
[null,null,null,null,null,null,{"$f":"CONCATENATE($E$408,\" \",H509)","v":"WSEC 2021 Option 3.11"},{"$f":"IF($E$408=$K$400,H513,H514)","v":"Option 3.11"},{"$f":"IFERROR(VLOOKUP($G509,Table_Option_39,$E$410,FALSE),\"\")","v":0.5},{"$f":"IFERROR(VLOOKUP($G509,Table_Option_39,4,FALSE),\"\")","v":"Connected Energy Star Certified smart thermostat."}]
[null,null,null,null,null,null,null,null,{"$f":"IFERROR(VLOOKUP($G510,Table_Option4,$E$410,FALSE),\"\")","v":""},{"$f":"IFERROR(VLOOKUP($G510,Table_Option4,4,FALSE),\"\")","v":""}]
[]
[null,null,null,null,"Option 3.11",null,"Option Data",null,null,"R3","R2","Select Desc","R3 Desc","R2 Desc"]
[null,null,null,null,"Check credits",null,{"$f":"$K$400","v":"WSEC 2021"},"Option 3.11",{"$f":"CONCATENATE($G$513,\" \",H513)","v":"WSEC 2021 Option 3.11"},0.5,0.5,{"$f":"IF($F$19=$N$401,M513,N513)","v":"Connected Energy Star Certified smart thermostat."},"Connected Energy Star Certified smart thermostat.","Connected Energy Star Certified smart thermostat."]
[null,null,null,null,null,null,{"$f":"$K$401","v":"WSEC 2018"},null,{"$f":"CONCATENATE($G$514,\" \",H514)","v":"WSEC 2018 "}]
[]
[]
[]
[]
[null,null,null,null,"Option 4",null,null,"Option 4.1",{"$f":"IFERROR(VLOOKUP(H519,Table_Option_4_Selected,2,TRUE),)","v":0.5}]
[null,null,null,null,null,null,null,"DropDown_Option_4"]
[null,null,null,null,null,null,"Selected Menu",null,null,"-"]
[null,null,null,null,null,null,null,"Not Selected",0]
[null,null,null,null,null,null,{"$f":"CONCATENATE($E$408,\" \",H523)","v":"WSEC 2021 Option 4.1"},{"$f":"IF($E$408=$K$400,H527,H529)","v":"Option 4.1"},{"$f":"IFERROR(VLOOKUP($G523,Table_Option4,$E$410,FALSE),\"\")","v":0.5},{"$f":"IFERROR(VLOOKUP($G523,Table_Option4,4,FALSE),\"\")","v":"Ducts/distribution system in conditioned space per R403.3.2 Electric resistance, hydronic, ductless and gas fired systems < 80% AFUE systems not permitted"}]
[null,null,null,null,null,null,{"$f":"CONCATENATE($E$408,\" \",H524)","v":"WSEC 2021 0"},{"$f":"IF($E$408=$K$400,H528,H530)","v":0},{"$f":"IFERROR(VLOOKUP($G524,Table_Option4,$E$410,FALSE),\"\")","v":""},{"$f":"IFERROR(VLOOKUP($G524,Table_Option4,4,FALSE),\"\")","v":""}]
[]
[null,null,null,null,null,null,"Option Data",null,null,"R3","R2","Select Desc","R3 Desc","R2 Desc"]
[null,null,null,null,null,1,{"$f":"$K$400","v":"WSEC 2021"},"Option 4.1",{"$f":"CONCATENATE($G$527,\" \",H527)","v":"WSEC 2021 Option 4.1"},0.5,"N/A",{"$f":"IF($F$19=$N$401,M527,N527)","v":"Ducts/distribution system in conditioned space per R403.3.2 Electric resistance, hydronic, ductless and gas fired systems < 80% AFUE systems not permitted"},"Ducts/distribution system in conditioned space per R403.3.2 Electric resistance, hydronic, ductless and gas fired systems < 80% AFUE systems not permitted","Ducts/distribution system in conditioned space per R403.3.2 Electric resistance, hydronic, ductless and gas fired systems < 80% AFUE systems not permitted"]
[null,null,null,null,null,{"$f":"F527+1","v":2},"Blank"]
[null,null,null,null,null,{"$f":"F528+1","v":3},{"$f":"$K$401","v":"WSEC 2018"},"Option 4.1",{"$f":"CONCATENATE($G$529,\" \",H529)","v":"WSEC 2018 Option 4.1"},0.5,0.5,{"$f":"IF($F$19=$N$401,M529,N529)","v":"Ducts deeply buried in unconditioned attic / Duct leakage<=3 cfm/100 sf of floor area"},"Ducts deeply buried in unconditioned attic / Duct leakage<=3 cfm/100 sf of floor area","Ducts deeply buried in unconditioned attic / Duct leakage<=3 cfm/100 sf of floor area"]
[null,null,null,null,null,{"$f":"F529+1","v":4},null,"Option 4.2",{"$f":"CONCATENATE($G$529,\" \",H530)","v":"WSEC 2018 Option 4.2"},1,"NA",{"$f":"IF($F$19=$N$401,M530,N530)","v":"Ducts/distribution system in conditioned space per R403.3.7"},"Ducts/distribution system in conditioned space per R403.3.7","Ducts/distribution system in conditioned space per R403.3.7"]
[]
[]
[null,null,null,null,"Option 5",null,null,"Option 5.1",{"$f":"IFERROR(VLOOKUP(H533,Table_Option_51_Selected,2,TRUE),0)","v":0.5}]
[null,null,null,null,null,null,null,"DropDown_Option_5a","Credits","Desc"]
[null,null,null,null,null,null,"Selected Menu"]
[null,null,null,null,null,null,null,"Not Selected"]
[null,null,null,null,null,null,{"$f":"CONCATENATE($E$408,\" \",H537)","v":"WSEC 2021 Option 5.1"},{"$f":"IF($E$408=$K$400,H540,H541)","v":"Option 5.1"},{"$f":"IFERROR(VLOOKUP($G537,Table_Option51,$E$410,FALSE),\"\")","v":0.5},{"$f":"IFERROR(VLOOKUP($G537,Table_Option51,4,FALSE),\"\")","v":"Drain Water Heat Recovery shall include Min. 2 showers incl. tub-showers w/ Min. efficiency of 40% for equal flow or 54% for unequal flow. Rated and labeled CSA B545.1 or IAPMMO IGC 346-2017"}]
[]
[null,null,null,null,null,null,"Option Data",null,null,"R3","R2","Select Desc","R3 Desc","R2 Desc"]
[null,null,null,null,null,1,{"$f":"$K$400","v":"WSEC 2021"},"Option 5.1",{"$f":"CONCATENATE($G$540,\" \",H540)","v":"WSEC 2021 Option 5.1"},0.5,0.5,{"$f":"IF($F$19=$N$401,M540,N540)","v":"Drain Water Heat Recovery shall include Min. 2 showers incl. tub-showers w/ Min. efficiency of 40% for equal flow or 54% for unequal flow. Rated and labeled CSA B545.1 or IAPMMO IGC 346-2017"},"Drain Water Heat Recovery shall include Min. 2 showers incl. tub-showers w/ Min. efficiency of 40% for equal flow or 54% for unequal flow. Rated and labeled CSA B545.1 or IAPMMO IGC 346-2017","Drain Water Heat Recovery shall include Min. 2 showers incl. tub-showers w/ Min. efficiency of 40% for equal flow or 54% for unequal flow. Rated and labeled CSA B545.1 or IAPMMO IGC 346-2017"]
[null,null,null,null,null,{"$f":"F540+1","v":2},{"$f":"$K$401","v":"WSEC 2018"},"Option 5.1",{"$f":"CONCATENATE($G$541,\" \",H541)","v":"WSEC 2018 Option 5.1"},0.5,0.5,{"$f":"IF($F$19=$N$401,M541,N541)","v":"Drain Water Heat Recovery"},"Drain Water Heat Recovery","Drain Water Heat Recovery"]
[]
[null,null,null,null,null,null,null,"Option 5.2",{"$f":"IFERROR(VLOOKUP(H543,Table_Option_52_Selected,E410,FALSE),0)","v":0.5}]
[null,null,null,null,null,null,null,"DropDown_Option_5a","Credits","Desc"]
[null,null,null,null,null,null,"Selected Menu"]
[null,null,null,null,null,null,null,"Not Selected"]
[null,null,null,null,null,null,{"$f":"CONCATENATE($E$408,\" \",H547)","v":"WSEC 2021 Option 5.2"},{"$f":"IF($E$408=$K$400,H550,\"\")","v":"Option 5.2"},{"$f":"IFERROR(VLOOKUP($G547,Table_Option52,$E$410,FALSE),0)","v":0.5},{"$f":"IFERROR(VLOOKUP($G547,Table_Option52,4,FALSE),0)","v":"Compact Hot Water Distribution System Max volume between heat source and fixture is 16 Oz per section R403.5.2, on demand circ. Pump may be required."}]
[]
[null,null,null,null,null,null,"Option Data",null,null,"R3","R2","Select Desc","R3 Desc","R2 Desc"]
[null,null,null,null,null,1,{"$f":"$K$400","v":"WSEC 2021"},"Option 5.2",{"$f":"CONCATENATE($G$550,\" \",H550)","v":"WSEC 2021 Option 5.2"},0.5,0.5,{"$f":"IF($F$19=$N$401,M550,N550)","v":"Compact Hot Water Distribution System Max volume between heat source and fixture is 16 Oz per section R403.5.2, on demand circ. Pump may be required."},"Compact Hot Water Distribution System Max volume between heat source and fixture is 16 Oz per section R403.5.2, on demand circ. Pump may be required.","Compact Hot Water Distribution System Max volume between heat source and fixture is 16 Oz per section R403.5.2, on demand circ. Pump may be required."]
[null,null,null,null,null,{"$f":"F550+1","v":2},{"$f":"$K$401","v":"WSEC 2018"}]
[]
[]
[]
[]
[null,null,null,null,null,null,null,"Option 5.3",{"$f":"IFERROR(VLOOKUP(H556,Table_Option_5_Selected,2,TRUE),0)","v":0.5}]
[null,null,null,null,null,null,null,"DropDown_Option_5bc","Credits","Desc"]
[null,null,null,null,null,null,"Selected Menu"]
[null,null,null,null,null,null,null,"Not Selected"]
[null,null,null,null,null,null,{"$f":"CONCATENATE($E$408,\" \",H560)","v":"WSEC 2021 Option 5.3"},{"$f":"IF($E$408=$K$400,H568,H574)","v":"Option 5.3"},{"$f":"IFERROR(VLOOKUP($G560,Table_Option5,$E$410,FALSE),\"\")","v":0.5},{"$f":"IFERROR(VLOOKUP($G560,Table_Option5,4,FALSE),\"\")","v":"Energy Star gas or propane water heater with min UEF of 0.80"}]
[null,null,null,null,null,null,{"$f":"CONCATENATE($E$408,\" \",H561)","v":"WSEC 2021 Option 5.4"},"Option 5.4",1,"Energy star gas or propane water heater with min UEF of 0.91 OR Solar supplemental water heating OR GSHP meeting requirements of Option 3.4"]
[null,null,null,null,null,null,"WSEC 2021 Option 5.5","Option 5.5",1.5,"Gas-fired heat pump water heater meeting NEEA Tier 2 "]
[null,null,null,null,null,null,"WSEC 2021 Option 5.6","Option 5.6",2,"Electric heat pump water heater meeting NEEA Tier 3.  "]
[null,null,null,null,null,null,{"$f":"CONCATENATE($E$408,\" \",H564)","v":"WSEC 2021 Option 5.7"},"Option 5.7",2.5,"Split system heat pump water heater with min UEF of 2.9 "]
[null,null,null,null,null,null,"WSEC 2021 Option 5.8","Option 5.8",2.5,"Combination water heating and space heating system with gas-fired heat pump water heater meeting NEEA Tier 2.  "]
[]
[null,null,null,null,null,null,"Option Data",null,null,"R3","R2","Select Desc","R3 Desc","R2 Desc"]
[null,null,null,null,null,1,{"$f":"$K$400","v":"WSEC 2021"},"Option 5.3",{"$f":"CONCATENATE($G$568,\" \",H568)","v":"WSEC 2021 Option 5.3"},0.5,0.5,{"$f":"IF($F$19=$N$401,M568,N568)","v":"Energy Star gas or propane water heater with min UEF of 0.80"},"Energy Star gas or propane water heater with min UEF of 0.80","Energy Star gas or propane water heater with min UEF of 0.80"]
[null,null,null,null,null,{"$f":"F568+1","v":2},null,"Option 5.4","WSEC 2021 Option 5.4",1,1,"Energy star gas or propane water heater with min UEF of 0.91 OR Solar supplemental water heating OR GSHP meeting requirements of Option 3.4","Energy star gas or propane water heater with min UEF of 0.91 OR Solar supplemental water heating OR GSHP meeting requirements of Option 3.4","Energy star gas or propane water heater with min UEF of 0.91 OR Solar supplemental water heating OR GSHP meeting requirements of Option 3.4"]
[null,null,null,null,null,{"$f":"F569+1","v":3},null,"Option 5.5","WSEC 2021 Option 5.5",1.5,1.5,"Gas-fired heat pump water heater meeting NEEA Tier 2 ","Gas-fired heat pump water heater meeting NEEA Tier 2 ","Gas-fired heat pump water heater meeting NEEA Tier 2 OR for R2, meeting ANSI Z21.40.2 and Z21.40.4 or CSA with min UEF of 1.15.  For R2, must serve all units"]
[null,null,null,null,null,4,null,"Option 5.6","WSEC 2021 Option 5.6",2,2.5,"Electric heat pump water heater meeting NEEA Tier 3.  ","Electric heat pump water heater meeting NEEA Tier 3.  ","Electric heat pump water heater meeting NEEA Tier 3.  For R2, must serve all units, any recirc piping must be insulated to R8"]
[null,null,null,null,null,5,null,"Option 5.7","WSEC 2021 Option 5.7",2.5,3,"Split system heat pump water heater with min UEF of 2.9 ","Split system heat pump water heater with min UEF of 2.9 ","Split system heat pump water heater with min UEF of 2.9 OR for R2, NEEA Tier 3."]
[null,null,null,null,null,6,null,"Option 5.8","WSEC 2021 Option 5.8",2.5,2.5,"Combination water heating and space heating system with gas-fired heat pump water heater meeting NEEA Tier 2.  ","Combination water heating and space heating system with gas-fired heat pump water heater meeting NEEA Tier 2.  ","Combination water heating and space heating system with gas-fired heat pump water heater meeting NEEA Tier 2.  For R2, must supply all units."]
[null,null,null,null,null,1,{"$f":"$K$401","v":"WSEC 2018"},"Option 5.2",{"$f":"CONCATENATE($G$574,\" \",H574)","v":"WSEC 2018 Option 5.2"},0.5,0.5,"Gas or propane water heater with min UEF of 0.80","Gas or propane water heater with min UEF of 0.80","Gas or propane water heater with min UEF of 0.80"]
[null,null,null,null,null,2,null,"Option 5.3",{"$f":"CONCATENATE($G$574,\" \",H575)","v":"WSEC 2018 Option 5.3"},1,1,"Gas or propane water heater with min UEF of 0.91 OR Solar supplemental OR GSHP","Gas or propane water heater with min UEF of 0.91 OR Solar supplemental OR GSHP","Gas or propane water heater with min UEF of 0.91 OR Solar supplemental OR GSHP"]
[null,null,null,null,null,3,null,"Option 5.4","WSEC 2018 Option 5.4",1.5,2,"NEEA Tier 1 heat pump water heater","NEEA Tier 1 heat pump water heater","NEEA Tier 1 heat pump water heater"]
[null,null,null,null,null,4,null,"Option 5.5","WSEC 2018 Option 5.5",2,2.5,"NEEA Tier 3 heat pump water heater","NEEA Tier 3 heat pump water heater","NEEA Tier 3 heat pump water heater"]
[null,null,null,null,null,5,null,"Option 5.6","WSEC 2018 Option 5.6",2.5,3,"Split system heat pump water heater with min UEF of 2.9 ","Split system heat pump water heater with min UEF of 2.9 ","Split system heat pump water heater with min UEF of 2.9 for R3 OR for R2, NEEA Tier 3."]
[null,null,null,null,null,{"$f":"F577+1","v":5},null,"-","WSEC 2018 -"]
[]
[]
[null,null,null,null,"NOT USED",null,"Only WSEC 2015","Option 5d: Drain Water Heat Recovery",{"$f":"IFERROR(VLOOKUP(H582,Table_Option_5d,2,TRUE),0)","v":0.5}]
[null,null,null,null,null,null,null,"DropDown_Option_5d","Credits","Desc"]
[null,null,null,null,null,null,null,"Not Selected",0,"-"]
[null,null,null,null,null,null,null,"Option 5d",0.5,"Drain Water Heat Recovery"]
[]
[]
[]
[null,null,null,null,"Option 6",null,null,"Option 6",{"$f":"IFERROR(VLOOKUP(H589,Table_Option_6_Selected,2,TRUE),0)","v":0}]
[null,null,null,null,null,null,null,"DropDown_Option_6","Credits","Desc"]
[null,null,null,null,null,null,"Selected Menu"]
[null,null,null,null,null,null,null,"Not Selected",0,"-"]
[null,null,null,null,null,null,{"$f":"CONCATENATE($E$408,\" \",H593)","v":"WSEC 2021 Option 6.1"},{"$f":"IF($E$408=$K$400,H596,H597)","v":"Option 6.1"},{"$f":"IFERROR(VLOOKUP(G593,Table_Option6,$E$410,FALSE),\"\")","v":2.5},{"$f":"IFERROR(VLOOKUP($G593,Table_Option6,4,FALSE),\"\")","v":"On-site wind or solar electric energy, 0.5 credit per 600 kWh of generation up to maximum of 4.5 credits"}]
[]
[null,null,null,null,null,null,"Option Data",null,null,"R3 (calculated)","R2 (calculated)","Select Desc","R3 Desc","R2 Desc"]
[null,null,null,null,null,1,{"$f":"$K$400","v":"WSEC 2021"},"Option 6.1",{"$f":"CONCATENATE($G$596,\" \",H596)","v":"WSEC 2021 Option 6.1"},{"$f":"IFERROR(MIN(4.5,FLOOR(0.5*$F$60/600,0.5)),\"\")","v":2.5},{"$f":"J596","v":2.5},{"$f":"IF($F$19=$N$401,M596,N596)","v":"On-site wind or solar electric energy, 0.5 credit per 600 kWh of generation up to maximum of 4.5 credits"},"On-site wind or solar electric energy, 0.5 credit per 600 kWh of generation up to maximum of 4.5 credits","On-site wind or solar electric energy, 0.5 credit per 600 kWh of generation up to maximum of 4.5 credits"]
[null,null,null,null,null,{"$f":"F596+1","v":2},{"$f":"$K$401","v":"WSEC 2018"},"Option 6.1",{"$f":"CONCATENATE($G$597,\" \",H597)","v":"WSEC 2018 Option 6.1"},{"$f":"IFERROR(MIN(3,ROUNDDOWN(1*$F$60/1200,0)),\"\")","v":2},{"$f":"J597","v":2},{"$f":"IF($F$19=$N$401,M597,N597)","v":"On-site wind or solar electric energy, 1 credit per 1200 kWh of generation up to maximum of 3 credits"},"On-site wind or solar electric energy, 1 credit per 1200 kWh of generation up to maximum of 3 credits","On-site wind or solar electric energy, 1 credit per 1200 kWh of generation up to maximum of 3 credits"]
[]
[]
[null,null,null,null,"Option 7",null,null,null,{"$f":"IFERROR(VLOOKUP(H600,Table_Option_6_Selected,2,TRUE),0)","v":0}]
[null,null,null,null,null,null,null,"DropDown_Option_6","Credits","Desc"]
[null,null,null,null,null,null,"Selected Menu"]
[null,null,null,null,null,null,null,"Not Selected",0,"-"]
[null,null,null,null,null,null,{"$f":"CONCATENATE($E$408,\" \",H604)","v":"WSEC 2021 Option 7.1"},{"$f":"H608","v":"Option 7.1"},{"$f":"IFERROR(VLOOKUP(G604,Table_Option7,$E$410,FALSE),\"\")","v":0.5},{"$f":"IFERROR(VLOOKUP($G604,Table_Option7,4,FALSE),\"\")","v":"All of:  Energy Star rated, most efficient dishwasher, refrigerator, washinging machine and dryer.  "}]
[]
[]
[null,null,null,null,null,null,"Option Data",null,null,"R3","R2","Select Desc","R3 Desc","R2 Desc"]
[null,null,null,null,null,1,{"$f":"$K$400","v":"WSEC 2021"},"Option 7.1",{"$f":"CONCATENATE($G$608,\" \",H608)","v":"WSEC 2021 Option 7.1"},0.5,1.5,{"$f":"IF($F$19=$N$401,M608,N608)","v":"All of:  Energy Star rated, most efficient dishwasher, refrigerator, washinging machine and dryer.  "},"All of:  Energy Star rated, most efficient dishwasher, refrigerator, washinging machine and dryer.  ","All of:  Energy Star rated, most efficient dishwasher, refrigerator, washinging machine and dryer.  "]
[null,null,null,null,null,null,{"$f":"$K$401","v":"WSEC 2018"},"Option 7.1",{"$f":"CONCATENATE($G$609,\" \",H609)","v":"WSEC 2018 Option 7.1"},0.5,1.5,{"$f":"IF($F$19=$N$401,M609,N609)","v":"Appliance Package"},"Appliance Package","Appliance Package"]
[]
[]
[]
[null,null,null,null,null,null,null,null,"Determine Baseline U-Values"]
[null,null,null,null,null,null,null,"Proposed Design"]
[null,null,null,null,null,null,null,"Selected U","Baseline Area","Baseline UA"]
[null,null,null,null,null,null,{"$f":"E29","v":"Doors U ="},{"$f":"HLOOKUP($F$629,Table_Uvalue_Options,U636,FALSE)","v":0.3},{"$f":"G29","v":91.1111111111111},{"$f":"IFERROR(H616*I616,\"\")","v":27.333333333333329}]
[null,null,null,null,null,null,"Overhead Glazing U =",{"$f":"HLOOKUP($F$629,Table_Uvalue_Options,U637,FALSE)","v":0.5},0,0]
[null,null,null,null,null,null,"Vertical Glazing U =",0.3,132.25,39.674999999999997]
[null,null,null,null,null,null," Flat/Vaulted Ceilings U =",2.4E-2,1578,37.872]
[null,null,null,null,null,null," Wall (above grade)  U =",5.6000000000000001E-2,2201.6800000000003,123.29408000000002,null,null,null,null,null,null,null,null,null,null,{"$f":"1/20","v":0.05}]
[null,null,null,null,null,null,"Floors over Crawlspace U =",2.9000000000000001E-2,1578,45.762]
[null,null,null,null,null,null,"Slab on Grade F =",0.54,0,0]
[null,null,null,null,null,null," Below Grade Wall U =","N/A",0,""]
[null,null,null,null,null,null," Below Grade Slab  F =","N/A",0,""]
[null,null,null,null,null,null,null,null,"Sum",{"$f":"SUM(J616:J624)","v":273.93641333333335}]
[]
[null,null,null,null,"SELECT BASELINE"]
[null,null,null,null,"Use of Calculator",{"$f":"IF(Menu_UseOfCalculator=MenuItem_NonDwellingUnit,MenuItem_UFactorPath,Menu_UseOfCalculator)","v":"Total UA Alternative, Whole Building Trade Off Analysis"}]
[null,null,null,null,"Search String",{"$f":"VLOOKUP(F628,Table_UseOfCalculator,J326,FALSE)","v":"Code Baseline"}]
[null,null,null,null,null,"U Values",null,null,null,null,null,null,null,null,null,null,null,null,null,null,null,null,null,null,"Baseline UA Values"]
[null,null,null,null,null,1,{"$f":"F631+1","v":2},{"$f":"G631+1","v":3},{"$f":"H631+1","v":4},{"$f":"I631+1","v":5},{"$f":"J631+1","v":6},7,null,{"$f":"L631+1","v":8},{"$f":"N631+1","v":9},{"$f":"O631+1","v":10},{"$f":"P631+1","v":11},{"$f":"Q631+1","v":12},{"$f":"R631+1","v":13},{"$f":"S631+1","v":14},null,{"$f":"N631+1","v":9},null,null,null,1,3,4,5,6]
[]
[null,null,null,null,null,null,null,null,"I think these Option U-values are not used.  Only the code baseline."]
[null,null,null,null,null,null,null,"WSEC 2021",null,null,null,null,"WSEC 2018"]
[null,null,null,"Selected",null,"Code Baseline","Existing Baseline",null,"Option 1.1","Option 1.2","Option 1.3","Option 1.4",null,"Option 1.1","Option 1.2","Option 1.3","Option 1.4","Option 1.5","Option 1.6","Option 1.7"]
[null,null,null,{"$f":"F29","v":0.3},"Doors  U =",{"$f":"IF(Menu_CodeVersion=$K$400,H636,M636)","v":0.3},{"$f":"IFERROR(AC85/AB85,0)","v":0.3},0.3,{"$f":"I638","v":0.22},0.25,0.18,0.18,0.3,{"$f":"N638","v":0.24},{"$f":"O638","v":0.2},0.22,0.25,0.18,0.18,0.28000000000000003,2]
[null,null,null,0.5,"Overhead Glazing U =",0.5,{"$f":"IFERROR(AC97/AB97,0)","v":0},0.5,0.5,0.5,{"$f":"F637","v":0.5},{"$f":"F637","v":0.5},0.5,{"$f":"F637","v":0.5},{"$f":"F637","v":0.5},{"$f":"I637","v":0.5},0.5,0.5,{"$f":"I637","v":0.5},{"$f":"J637","v":0.5},3]
[null,null,null,0.3,"Vertical Glazing  U =",0.3,{"$f":"AC166","v":0.3},0.3,0.22,0.25,0.18,0.18,0.3,0.24,0.2,0.22,0.25,0.18,0.18,0.28000000000000003,4]
[null,null,null,2.4E-2," Flat/Vaulted Ceilings U =",2.4E-2,{"$f":"IFERROR(AC177/AB177,0)","v":0.02},2.4E-2,2.4E-2,2.4E-2,0.17,0.17,2.5999999999999999E-2,{"$f":"F639","v":2.4E-2},{"$f":"F639","v":2.4E-2},2.4E-2,2.4E-2,0.17,1.7000000000000001E-2,0.02,5]
[null,null,null,5.6000000000000001E-2," Wall (above grade)  U =",5.6000000000000001E-2,{"$f":"IFERROR(AC192/AB192,0)","v":5.6000000000000001E-2},5.6000000000000001E-2,4.4999999999999998E-2,4.4999999999999998E-2,3.2000000000000001E-2,0.28000000000000003,5.6000000000000001E-2,5.6000000000000001E-2,5.6000000000000001E-2,4.4999999999999998E-2,4.4999999999999998E-2,3.2000000000000001E-2,2.8000000000000001E-2,{"$f":"J640","v":4.4999999999999998E-2},6]
[null,null,null,2.9000000000000001E-2,"Floors  U =",2.9000000000000001E-2,{"$f":"IFERROR(AC204/AB204,0)","v":0},2.9000000000000001E-2,2.9000000000000001E-2,2.5000000000000001E-2,2.5000000000000001E-2,0.02,2.9000000000000001E-2,2.9000000000000001E-2,2.9000000000000001E-2,2.9000000000000001E-2,2.5000000000000001E-2,2.5000000000000001E-2,0.02,{"$f":"J641","v":2.5000000000000001E-2},7]
[null,null,null,0.54,"Slab on Grade  F =",0.54,{"$f":"IFERROR(AC215/AB215,0)","v":0.54},0.54,0.54,0.36,0.36,0.26100000000000001,0.54,0.54,0.54,0.54,0.36,0.36,0.26100000000000001,{"$f":"J642","v":0.36},8]
[null,null,null,"N/A"," Below Grade Wall  U =","N/A",{"$f":"IFERROR(Y226/X226,0)","v":0},{"$f":"$M$939","v":"N/A"},4.2000000000000003E-2,5.5E-2,5.5E-2,3.4000000000000002E-2,{"$f":"$M$939","v":"N/A"},"N/A","N/A",{"$f":"I643","v":4.2000000000000003E-2},5.5E-2,5.5E-2,3.4000000000000002E-2,{"$f":"J643","v":5.5E-2},9,null,null,null,null,null,null,null,null,null,null,"Calculated values - Don't overwrite values in orange."]
[null,null,null,"N/A"," Below Grade Slab  F =","N/A",{"$f":"IFERROR(AC226/AB226,0)","v":0},{"$f":"$N$939","v":"N/A"},0.59,0.29299999999999998,0.29299999999999998,0.30399999999999999,{"$f":"$N$939","v":"N/A"},"N/A","N/A",{"$f":"I644","v":0.59},0.29299999999999998,0.29299999999999998,0.30399999999999999,{"$f":"J644","v":0.29299999999999998},10,null,null,null,null,null,null,null,null,null,null,"Calculated values - Don't overwrite values in orange."]
[null,null,null,null,null,null,null,null,"Baylon:  R-11 batt (U=0.095)+R10 under slab"]
[]
[]
[null,null,null,null,null,null,null,"Determine Baseline Areas for Proposal"]
[null,null,null,null,null,null,{"$f":"E329","v":"U-Factor Compliance Path"}]
[null,null,null,null,null,null,"Code Baseline","Code Baseline","Existing Baseline","Proposed",null,null,"Selected Baseline"]
[null,null,null,null,null,null,{"$f":"E329","v":"U-Factor Compliance Path"},{"$f":"MenuItem_NonDwellingUnit","v":"Non-Dwelling Unit (Total UA)"},{"$f":"E331","v":"User-Defined Baseline (Addition/Remodel/Alteration of Existing)"},"Total UA Alternative, Whole Building Trade Off Analysis",null,null,{"$f":"Menu_UseOfCalculator","v":"Total UA Alternative, Whole Building Trade Off Analysis"}]
[null,null,null,null,null,null,"Area",{"$f":"G652","v":"Area"},"Area","Area",null,null,"Area"]
[null,null,null,null,null,"Doors  U =",{"$f":"IF(M$29=\"\",\"Error\",M$29)","v":91.1111111111111},{"$f":"IF(M$29=\"\",\"Error\",M$29)","v":91.1111111111111},{"$f":"AB85","v":20},{"$f":"M29","v":91.1111111111111},3,null,{"$f":"HLOOKUP(Menu_UseOfCalculator,Table_Areas,K653,FALSE)","v":91.1111111111111}]
[null,null,null,null,null,"Overhead Glazing U =",{"$f":"IF(M$30=\"\",\"Error\",IF(M$30<(H$66*0.15),M$30,H$66*0.15))","v":0},{"$f":"G654","v":0},{"$f":"AB97","v":0},{"$f":"M30","v":0},{"$f":"K653+1","v":4},null,{"$f":"HLOOKUP(Menu_UseOfCalculator,Table_Areas,K654,FALSE)","v":0}]
[null,null,null,null,null,"Vertical Glazing  U =",{"$f":"IF(M$31=\"\",\"Error\",IF(F377=\"No\",M165,IF(SUM(M$31,M$30)>H$66*0.15,H$66*0.15-G$654,M$31)))","v":132.25},132.25,{"$f":"AB165","v":160},{"$f":"IF(M$31=\"\",\"Error\",IF(F377=\"No\",M165,IF(SUM(M$31,M$30)>H$66*0.15,H$66*0.15-G$654,M$31)))","v":132.25},{"$f":"K654+1","v":5},null,{"$f":"HLOOKUP(Menu_UseOfCalculator,Table_Areas,K655,FALSE)","v":132.25},"3/19/2024:  Max glazing percent in baseline added to all but remodels"]
[null,null,null,null,null," Flat/Vaulted Ceilings U =",{"$f":"IFERROR((M$32+M$30)-G$654,\"Error\")","v":1578},1578,{"$f":"AB177","v":491},{"$f":"M32","v":1578},6,null,1578]
[null,null,null,null,null," Wall (above grade)  U =",{"$f":"IFERROR((M33+M29+M31)-(G655+G653),\"Error\")","v":2201.6800000000003},2201.6800000000003,{"$f":"AB192","v":1134},{"$f":"IFERROR((M33+M29+M31)-(G655+G653),\"Error\")","v":2201.6800000000003},7,null,2201.6800000000003]
[null,null,null,null,null,"Floors  U =",{"$f":"IF(M34=\"\",\"Error\",M34)","v":1578},1578,{"$f":"AB204","v":0},{"$f":"M34","v":1578},8,null,1578]
[null,null,null,null,null,"Slab on Grade  F =",{"$f":"IF(M35=\"\",\"Error\",M35)","v":0},0,{"$f":"AB215","v":139},{"$f":"M35","v":0},9,null,0]
[null,null,null,null,null," Below Grade Wall  U =",{"$f":"IF(M36=\"\",\"Error\",M36)","v":0},0,{"$f":"X226","v":0},{"$f":"M36","v":0},10,null,0]
[null,null,null,null,null," Below Grade Slab  F =",{"$f":"IF(M37=\"\",\"Error\",M37)","v":0},0,{"$f":"AB226","v":0},{"$f":"M37","v":0},11,null,0]
[]
[null,null,null,null,"Heating System Sizing Worksheet"]
[null,null,null,null,"Volume, Proposed",{"$f":"IFERROR(IF(OR(F279=\"\",F279=0),F278*8.5,F279),F278*8.5)","v":17850},"ft3 default"]
[null,null,null,null,"Volume, Baseline",{"$f":"IFERROR(IF(OR(U279=\"\",U279=0),U278*8.5,U279),U278*8.5)","v":18836},"ft3 default"]
[]
[null,null,null,null,"Total UA including exempt window and door","Proposed"]
[null,null,null,null,"UA excluding exempt window and door",{"$f":"N39","v":234.15589333333332}]
[null,null,null,null,"Exempt door",{"$f":"IFERROR(SUBTOTAL(109,N74),0)","v":0}]
[null,null,null,null,"Exempt window",{"$f":"IFERROR(SUBTOTAL(109,N104),0)","v":0}]
[null,null,null,null,"Total UA",{"$f":"IF(F668=\"Check Missing Inputs\",F668,SUM(F668:F670))","v":234.15589333333332}]
[null,null,null,null,null,null,null,"Selected Proposal",{"$f":"IF(OR(C48=2,C48=4),H675,H676)","v":"Heat Pump"}]
[null,null,null,null,"Table_DuctLossMultiplier, DropDown_DuctLocation, DropDown_AirHandlerLocation",null,null,"Table_MaxOutputMultiplier"]
[]
[null,null,null,null,"Conditioned Space",1,null,"Heat Pump",1.25]
[null,null,null,null,"Unconditioned Space",1.1000000000000001,null,"All Other Systems (not heat pump)",1.4]
[null,null,null,null,{"$f":"IF(Menu_HydronicHeatingSystem=\"No\",\"Unducted\",\"\"\"\")","v":"Unducted"},1,null,"Selected System Proposed",{"$f":"VLOOKUP(I672,Table_MaxOutputMultiplier,2,FALSE)","v":1.25}]
[null,null,null,null,"Selected ducts, Proposed",{"$f":"VLOOKUP(G255,Table_DuctLossMultiplier,2,FALSE)","v":1.1000000000000001},null,"Selected System Baseline",{"$f":"VLOOKUP(U283,Table_MaxOutputMultiplier,2,FALSE)","v":1.4}]
[null,null,null,null,"Selected ducts, Baseline",{"$f":"VLOOKUP(U284,Table_DuctLossMultiplier,2,FALSE)","v":1.1000000000000001}]
[]
[null,null,null,null,null,null,null,null,null,null,null,"Fuel Normalization Credits",null,"Energy Credits",null,"Total Credits"]
[null,null,null,null,null,null,null,null,null,null,null,{"$f":"L48","v":3},null,{"$f":"J62","v":5},null,{"$f":"IF(ISNUMBER(L682)=TRUE,L682+N682,N682)","v":8}]
[]
[]
[null,null,null,"TABLE R406.2"]
[null,null,null,"FUEL NORMALIZATION CREDITS -- SELECTED",null,null,"Credit Column",{"$f":"IF(F19=N388,H687,G687)","v":4}]
[null,null,null,1,2,3,4,5]
[null,null,null,"DropDown_FuelNormalizationSystem",null,null,"Credits"]
[null,null,null,null,"Description of Primary Heating Source","System Number","All Other","Group R-2"]
[null,null,null,{"$f":"IF(Menu_CodeVersion=MenuItem_WSEC2018,D712,D701)","v":"Combustion System"},{"$f":"IF(Menu_CodeVersion=$K$400,E701,E712)","v":"Combustion heating equipment meeting minimum federal efficiency standards for the equipment listed in Table C403.3.2(5) or C403.3.2(6)"},1,0,0]
[null,null,null,{"$f":"IF(Menu_CodeVersion=MenuItem_WSEC2018,D713,D702)","v":"Heat Pump with Supplemental Heating"},"For heating system using a heat pump that meets federal standards for the equipment listed in Table C403.3.2(2) and supplemental heating provided by electric resistance or a combustion furnace meeting minimum standards Listed in Table C403.3.2(5)b found in the 2021 WSEC - COMMERCIAL ENERGY CODE.",2,1.5,0]
[null,null,null,{"$f":"IF(Menu_CodeVersion=MenuItem_WSEC2018,D714,D703)","v":"Electric Resistance Only"},"For heating system based on electric resistance only (either forced air or Zonal)",3,0.5,-0.5]
[null,null,null,{"$f":"IF(Menu_CodeVersion=MenuItem_WSEC2018,D715,D704)","v":"Variable Refrigerant Heat Pump or Air-to-Water Heat Pump"},"For heating system using a heat pump that meets federal standards for the equipment listed in Table C403.3.2(2) or Table C403.3.2(9) OR Air to Water heat pump units that are configured to provide both heating and cooling and are rated in accordance with AHRI 550/590 ",4,3,2]
[null,null,null,{"$f":"IF(Menu_CodeVersion=MenuItem_WSEC2018,D716,D705)","v":"Electric Resistance with Ductless Heat Pump OR electric resistance with max 2 kW installed capacity"},"For heating system based on electric resistance with (1) inverter driven ductless mini-split heat pump system installed in the largest zone in the dwelling OR (2) With 2kW or less total installed heating capacity per dwelling",5,2,0]
[]
[null,null,null,"TABLE R406.2"]
[null,null,null,"FUEL NORMALIZATION CREDITS -- WSEC 2021",null,null,"Credit Column",{"$f":"IF(F30=N399,H698,G698)","v":4}]
[null,null,null,1,2,3,4,5]
[null,null,null,"DropDown_FuelNormalizationSystem",null,null,"Credits"]
[null,null,null,null,"Description of Primary Heating Source","System Number","All Other","Group R-2"]
[null,null,null,{"$f":"E746","v":"Combustion System"},"Combustion heating equipment meeting minimum federal efficiency standards for the equipment listed in Table C403.3.2(5) or C403.3.2(6)",1,0,0]
[null,null,null,{"$f":"E747","v":"Heat Pump with Supplemental Heating"},"For heating system using a heat pump that meets federal standards for the equipment listed in Table C403.3.2(2) and supplemental heating provided by electric resistance or a combustion furnace meeting minimum standards Listed in Table C403.3.2(5)b found in the 2021 WSEC - COMMERCIAL ENERGY CODE.",2,1.5,0]
[null,null,null,"Electric Resistance Only","For heating system based on electric resistance only (either forced air or Zonal)",3,0.5,-0.5]
[null,null,null,"Variable Refrigerant Heat Pump or Air-to-Water Heat Pump","For heating system using a heat pump that meets federal standards for the equipment listed in Table C403.3.2(2) or Table C403.3.2(9) OR Air to Water heat pump units that are configured to provide both heating and cooling and are rated in accordance with AHRI 550/590 ",4,3,2]
[null,null,null,"Electric Resistance with Ductless Heat Pump OR electric resistance with max 2 kW installed capacity","For heating system based on electric resistance with (1) inverter driven ductless mini-split heat pump system installed in the largest zone in the dwelling OR (2) With 2kW or less total installed heating capacity per dwelling",5,2,0]
[]
[null,null,null,"TABLE R406.2"]
[null,null,null,"FUEL NORMALIZATION CREDITS -- WSEC 2018",null,null,"Credit Column"]
[null,null,null,1,2,3,4,5]
[null,null,null,"DropDown_FuelNormalizationSystem",null,null,"Credits"]
[null,null,null,null,"Description of Primary Heating Source","System Number","All Other","Group R-2"]
[null,null,null,{"$f":"E759","v":"Min Federal Efficiency System"},"Combustion heating equipment meeting minimum federal efficiency standards for the equipment listed in Table C403.3.2(4) or C403.3.2(5)",1,0,0]
[null,null,null,{"$f":"E760","v":"Heat Pump"},"For an initial heating system using a heat pump that meets federal standards for the equipment listed in Table C403.3.2(1)C or C403.3.2(2)  OR Air to water heat pump units that are configured to provide both heating and cooling and are rated in accordance with AHRI 550/590.  Heat pump with electric resistance or fossil-fuel supplemental heat requires compliance with WSEC 403.1.2 \"Heat Pump Supplementary Heat\". Packaged Terminal Heat Pumps (PTAC-HP) requires an HSPF tested value (See SBC Interpretation dated December 2020).",2,1,1]
[null,null,null,{"$f":"E761","v":"Electric Resistance Only"},"For heating system based on electric resistance only (either forced air or Zonal)",3,-1,-1]
[null,null,null,{"$f":"E762","v":"Electric Resistance with Ductless Heat Pump"},"For heating system based on electric resistance with a ductless mini-split heat pump system in accordance with Section R403.7.1 including the exception",4,0.5,"N/A for R2"]
[null,null,null,{"$f":"E763","v":"All Other Heating Systems"},"All other heating systems",5,-1,-0.5]
[]
[]
[]
[]
[]
[]
[null,null,null,null,"Tool behavior:  Change fuel normalization menu in response to Option 3?","No"]
[null,null,null,null,"Selected Option 3",{"$f":"H54","v":"Option 3.7"}]
[null,null,null,null,"Selected Fuel Norm",{"$f":"H48","v":"Variable Refrigerant Heat Pump or Air-to-Water Heat Pump"}]
[null,null,null,null,"MessageWarning_FuelNormalizationSystem",{"$f":"IF(F724=0,\"\",IF(ISERROR(VLOOKUP(F725,DropDown_FuelNormalizationSystem,1,FALSE))=TRUE,\"Reselect System\",\"\"))","v":""}]
[null,null,null,null,"MessageWarning_FuelNormalizationOption","Reselect Option"]
[null,null,null,null,null,"DropDown_FuelNormalizationSystem"]
[null,null,null,1,{"$f":"Menu_CodeVersion","v":"WSEC 2021"},null,null,{"$f":"$H463","v":"Not Selected"},{"$f":"$H464","v":"Option 3.1"},{"$f":"$H465","v":"Option 3.2"},{"$f":"$H466","v":"Option 3.3"},{"$f":"$H467","v":"Option 3.4"},{"$f":"$H468","v":"Option 3.5"},{"$f":"$H469","v":"Option 3.6"},{"$f":"H470","v":"Option 3.7"},{"$f":"$H471","v":"Option 3.8"},{"$f":"$H472","v":"Option 3.9"},{"$f":"H473","v":"Option 3.10"}]
[null,null,null,2,{"$f":"IF(Menu_CodeVersion=$E$745,E746,E759)","v":"Combustion System"},{"$f":"IF(F$723=\"No\",E730,IF(F$724=0,E730,IF(G730=0,\"\",G730)))","v":"Combustion System"},{"$f":"IFERROR(HLOOKUP(F$724,Table_FuelNormCreditOption3Rules,D730,FALSE),\"\")","v":"Variable Refrigerant Heat Pump or Air-to-Water Heat Pump"},{"$f":"IF(Menu_CodeVersion=$E$745,E741,E754)","v":"Combustion System"},{"$f":"IF(Menu_CodeVersion=$E$745,$F741,$F754)","v":"Combustion System"},"Heat Pump with Supplemental Heating","Variable Refrigerant Heat Pump or Air-to-Water Heat Pump","Variable Refrigerant Heat Pump or Air-to-Water Heat Pump","Electric Resistance with Ductless Heat Pump OR electric resistance with max 2 kW installed capacity","Variable Refrigerant Heat Pump or Air-to-Water Heat Pump",{"$f":"IF(Menu_CodeVersion=$E$745,L741,L754)","v":"Variable Refrigerant Heat Pump or Air-to-Water Heat Pump"},{"$f":"IF(Menu_CodeVersion=$E$745,M741,L754)","v":"Variable Refrigerant Heat Pump or Air-to-Water Heat Pump"},{"$f":"IF(Menu_CodeVersion=$E$745,N741,N754)","v":"Combustion System"},{"$f":"IF(Menu_CodeVersion=$E$745,O741,O754)","v":"Combustion System"}]
[null,null,null,3,{"$f":"IF(Menu_CodeVersion=$E$745,E747,E760)","v":"Heat Pump with Supplemental Heating"},{"$f":"IF(F$723=\"No\",E731,IF(F$724=0,E731,IF(#REF!=0,\"\",#REF!)))","v":"Heat Pump with Supplemental Heating"},{"$f":"IFERROR(HLOOKUP(F$724,Table_FuelNormCreditOption3Rules,D731,FALSE),\"\")","v":0},{"$f":"IF(Menu_CodeVersion=$E$745,$E742,$E755)","v":0},0,0,"Heat Pump with Supplemental Heating",0,0,0,{"$f":"IF(Menu_CodeVersion=$E$745,L742,L755)","v":0},0,{"$f":"IF(Menu_CodeVersion=$E$745,N742,N755)","v":0},{"$f":"IF(Menu_CodeVersion=$E$745,O742,O755)","v":0}]
[null,null,null,4,{"$f":"IF(Menu_CodeVersion=$E$745,E748,E761)","v":"Electric Resistance Only"},{"$f":"IF(F$723=\"No\",E732,IF(F$724=0,E732,IF(G732=0,\"\",G732)))","v":"Electric Resistance Only"},{"$f":"IFERROR(HLOOKUP(F$724,Table_FuelNormCreditOption3Rules,D732,FALSE),\"\")","v":0}]
[null,null,null,5,{"$f":"IF(Menu_CodeVersion=$E$745,E749,E762)","v":"Variable Refrigerant Heat Pump or Air-to-Water Heat Pump"},{"$f":"IF(F$723=\"No\",E733,IF(F$724=0,E733,IF(G733=0,\"\",G733)))","v":"Variable Refrigerant Heat Pump or Air-to-Water Heat Pump"},{"$f":"IFERROR(HLOOKUP(F$724,Table_FuelNormCreditOption3Rules,D733,FALSE),\"\")","v":0}]
[null,null,null,6,{"$f":"IF(Menu_CodeVersion=$E$745,E750,E763)","v":"Electric Resistance with Ductless Heat Pump OR electric resistance with max 2 kW installed capacity"},{"$f":"IF(F$723=\"No\",E734,IF(F$724=0,E734,IF(G734=0,\"\",G734)))","v":"Electric Resistance with Ductless Heat Pump OR electric resistance with max 2 kW installed capacity"},{"$f":"IFERROR(HLOOKUP(F$724,Table_FuelNormCreditOption3Rules,D734,FALSE),\"\")","v":0}]
[null,null,null,null,1,{"$f":"E735+1","v":2},{"$f":"F735+1","v":3},4,5,6,7,8,9,{"$f":"M735+1","v":10},null,{"$f":"M735+1","v":10},null,{"$f":"N735+1","v":11}]
[null,null,null,null,"Error_Option3",{"$f":"IF(Menu_CodeVersion=$E$745,N751,L764)","v":0}]
[null,null,null,null,"Error_FuelNorm"]
[null,"SYSTEM COMPATIBILITY TABLE"]
[]
[null,null,null,2021,"Not Selected","Option 3.1","Option 3.2","Option 3.3","Option 3.4","Option 3.5","Option 3.6","Option 3.7","Option 3.8","Option 3.9","Option 3.10"]
[null,null,null,"Enter Defaults if Error",{"$f":"E730","v":"Combustion System"},{"$f":"$E746","v":"Combustion System"},{"$f":"E747","v":"Heat Pump with Supplemental Heating"},{"$f":"$E$749","v":"Variable Refrigerant Heat Pump or Air-to-Water Heat Pump"},{"$f":"$E$749","v":"Variable Refrigerant Heat Pump or Air-to-Water Heat Pump"},{"$f":"E750","v":"Electric Resistance with Ductless Heat Pump OR electric resistance with max 2 kW installed capacity"},{"$f":"$E$749","v":"Variable Refrigerant Heat Pump or Air-to-Water Heat Pump"},{"$f":"$E$749","v":"Variable Refrigerant Heat Pump or Air-to-Water Heat Pump"},{"$f":"$E$749","v":"Variable Refrigerant Heat Pump or Air-to-Water Heat Pump"},{"$f":"$E746","v":"Combustion System"},{"$f":"$E746","v":"Combustion System"}]
[null,null,null,"Also ok",null,null,null,{"$f":"$E$747","v":"Heat Pump with Supplemental Heating"}]
[]
[]
[null,null,null,null,{"$f":"$K$400","v":"WSEC 2021"},"Compatible Systems",null,null,null,null,null,null,null,"Error? = 1"]
[null,null,null,1,"Combustion System",{"$f":"I729","v":"Option 3.1"},null,null,null,null,null,"Option 3.9","Option 3.10",{"$f":"IF(F$725=E746,IF(ISERROR(HLOOKUP(F$724,F746:M746,1,FALSE))=TRUE,1,0),0)","v":0}]
[null,null,null,2,"Heat Pump with Supplemental Heating","Option 3.2","Option 3.3",null,null,null,null,null,null,{"$f":"IF(F$725=E747,IF(ISERROR(HLOOKUP(F$724,F747:M747,1,FALSE))=TRUE,1,0),0)","v":0}]
[null,null,null,3,"Electric Resistance Only",null,null,null,null,null,null,null,null,{"$f":"IF(F$725=E748,IF(ISERROR(HLOOKUP(F$724,F748:M748,1,FALSE))=TRUE,1,0),0)","v":0}]
[null,null,null,4,"Variable Refrigerant Heat Pump or Air-to-Water Heat Pump","Option 3.3","Option 3.4","Option 3.6","Option 3.7","Option 3.8",null,null,null,{"$f":"IF(F$725=E749,IF(ISERROR(HLOOKUP(F$724,F749:M749,1,FALSE))=TRUE,1,0),0)","v":0}]
[null,null,null,5,"Electric Resistance with Ductless Heat Pump OR electric resistance with max 2 kW installed capacity","Option 3.5",null,null,null,null,null,null,null,{"$f":"IF(F$725=E750,IF(ISERROR(HLOOKUP(F$724,F750:M750,1,FALSE))=TRUE,1,0),0)","v":0}]
[null,null,null,null,null,null,null,null,null,null,null,null,"Error",{"$f":"SUM(N746:N750)","v":0}]
[null,null,null,null,null,"Fossil","HP with ","GSHP","Ductless","ASHP",null,"Ductless"]
[null,null,null,2018,"Not Selected","Option 3.1","Option 3.2","Option 3.3","Option 3.4","Option 3.5.1","Option 3.5.2","Option 3.6"]
[null,null,null,"Enter Defaults if Error",{"$f":"E741","v":"Combustion System"},{"$f":"E759","v":"Min Federal Efficiency System"},{"$f":"E760","v":"Heat Pump"},{"$f":"$E760","v":"Heat Pump"},{"$f":"E762","v":"Electric Resistance with Ductless Heat Pump"},{"$f":"E760","v":"Heat Pump"},{"$f":"E760","v":"Heat Pump"},{"$f":"E760","v":"Heat Pump"}]
[null,null,null,"Also ok"]
[]
[]
[null,null,null,null,{"$f":"$K$401","v":"WSEC 2018"},"Compatible Systems",null,null,null,null,null,"Error? = 1"]
[null,null,null,1,"Min Federal Efficiency System","Option 3.1",null,null,null,null,null,{"$f":"IF(F$725=E759,IF(ISERROR(HLOOKUP(F$724,F759:K759,1,FALSE))=TRUE,1,0),0)","v":0}]
[null,null,null,2,"Heat Pump","Option 3.2","Option 3.3","Option 3.5.1","Option 3.5.2","Option 3.6",null,{"$f":"IF(F$725=E760,IF(ISERROR(HLOOKUP(F$724,F760:K760,1,FALSE))=TRUE,1,0),0)","v":0}]
[null,null,null,3,"Electric Resistance Only",null,null,null,null,null,null,{"$f":"IF(F$725=E761,IF(ISERROR(HLOOKUP(F$724,F761:K761,1,FALSE))=TRUE,1,0),0)","v":0}]
[null,null,null,4,"Electric Resistance with Ductless Heat Pump","Option 3.4",null,null,null,null,null,{"$f":"IF(F$725=E762,IF(ISERROR(HLOOKUP(F$724,F762:K762,1,FALSE))=TRUE,1,0),0)","v":0}]
[null,null,null,5,"All Other Heating Systems",null,null,null,null,null,null,{"$f":"IF(F$725=E763,IF(ISERROR(HLOOKUP(F$724,F763:K763,1,FALSE))=TRUE,1,0),0)","v":0}]
[null,null,null,null,null,null,null,null,null,null,"Error",{"$f":"SUM(L759:L763)","v":0}]
[]
[]
[]
[]
[null,null,null,null,2021,1,2,3,4,5,6,7]
[null,null,null,null,null,null,null,null,"Message 1",null,"Message 2",null,"Option 1.1 Window U max "]
[null,null,null,null,null,"WSEC 2021",{"$f":"MenuItem_WSEC2018","v":"WSEC 2018"},"Target UA","2018 Message","2021 Message","2018 Message","2021 Message",2018,2021]
[null,null,null,null,null,null,"Option 1.1",0.05,{"$f":"IF($N$166<=M772,\"Window U-value meets selected Option 1.1\",\"Window U-value does NOT meet selected Option 1.1. \")","v":"Window U-value does NOT meet selected Option 1.1. "},null,{"$f":"IF($N$166<=M772,\"\",\"Window U-value does NOT meet selected Option 1.1. \")","v":"Window U-value does NOT meet selected Option 1.1. "},null,0.24,0.22]
[null,null,null,null,null,"Option 1.1","Option 1.2",null,{"$f":"IF($N$166<=N772,\"Window U-value meets selected Option 1.2\",\"\")","v":""},{"$f":"IF($N$166<=N772,\"Window U-value meets selected Option 1.1\",\"Window U-value does NOT meet selected Option 1.1. \")","v":"Window U-value does NOT meet selected Option 1.1. "},{"$f":"IF($N$166<=N772,\"Window U-value meets selected Option 1.2\",\"\")","v":""},{"$f":"IF($N$166<=N772,\"\",\"Window U-value does NOT meet selected Option 1.1. \")","v":"Window U-value does NOT meet selected Option 1.1. "}]
[null,null,null,null,null,null,"Option 1.3",0.05]
[null,null,null,null,null,"Option 1.2","Option 1.4",0.15]
[null,null,null,null,null,"Option 1.3",null,0.22500000000000001]
[null,null,null,null,null,"Option 1.4","Option 1.5",0.3]
[null,null,null,null,null,null,"Option 1.6",0.4]
[null,null,null,null,null,"Selected",{"$f":"Menu_CodeVersion","v":"WSEC 2021"}]
[null,null,null,null,null,{"$f":"Menu_Option1","v":"Option 1.2"},{"$f":"ROUND(N42*100,0)/100","v":0.15},"Round to the whole percentage point for comparison with target"]
[null,null,null,null,null,"Target",{"$f":"IFERROR(IF(Menu_CodeVersion=MenuItem_WSEC2018,VLOOKUP(F780,G772:J778,2,FALSE),VLOOKUP(F780,F772:J778,3,FALSE)),0)","v":0.15}]
[null,null,null,null,null,"Window Message 1",{"$f":"IFERROR(IF(Menu_CodeVersion=MenuItem_WSEC2018,VLOOKUP(F780,G772:L778,3,FALSE),VLOOKUP(F780,F772:L778,5,FALSE)),\"\")","v":0},{"$f":"IFERROR(IF(Menu_CodeVersion=MenuItem_WSEC2018,VLOOKUP(F780,G772:L778,5,FALSE),VLOOKUP(F780,F772:L778,7,FALSE)),\"\")","v":0}]
[null,null,null,null,null,"UA Message 2",{"$f":"IF(G781=0,\"\",IF(AND(G781>0,G780>=G781),CONCATENATE(\" UA reduction meets percent target of selected \",F780),CONCATENATE(\" UA reduction does NOT meet percent target of selected \",F780)))","v":" UA reduction meets percent target of selected Option 1.2"}]
[null,null,null,null,null,"Combined Message",{"$f":"IF(G782<>0,CONCATENATE(G782,G783),G783)","v":" UA reduction meets percent target of selected Option 1.2"}]
[null,null,null,null,null,"If User Defined baseline and addition","-"]
[null,null,null,null,null,"Selected Message in results",{"$f":"IF(Menu_UseOfCalculator=MenuItem_NonDwellingUnit,\"-\",IF(AND(Menu_ProjectType=Item_ProjectType_Addition,Menu_UseOfCalculator=MenuItem_UserDefinedBaseline),G785,G784))","v":" UA reduction meets percent target of selected Option 1.2"}]
[null,null,null,null,null,"Message at Option 1",{"$f":"IF(OR(F780=\"Not Selected\",F780=\"\"),\"\",IF(Menu_Option1=\"Option 1.1\",H782,IF(AND(G781>0,G780>=G781),\"\",CONCATENATE(\" UA reduction does NOT meet percent target of selected \",F780))))","v":""}]
[null,null,null,null,null,"Option 1 Target UA Pass/Fail",{"$f":"IF(OR(F780=\"Not Selected\",F780=\"\"),\"PASS\",IF(G781=0,\"\",IF(AND(G781>0,G780>=G781),\"PASS\",\"FAIL\")))","v":"PASS"}]
[null,null,null,null,null,"Option 1.1 Window PASS/FAIL",{"$f":"IF(G787<>\"\",\"FAIL\",\"PASS\")","v":"PASS"}]
[null,null,null,"VENTILATION"]
[]
[null,null,null,null,null,null,null,"Continuous","Intermittent"]
[null,null,null,null,{"$f":"'Group R'!N400","v":"R2 Multifamily"},"IMC","Section 403",{"$f":"F817","v":100},{"$f":"F819","v":125}]
[null,null,null,null,{"$f":"'Group R'!N401","v":"R3 Single family dwellings and townhouses"},"IRC","Chapter 15",{"$f":"F840","v":55},{"$f":"F842","v":68.75}]
[]
[null,null,null,null,"Occupancy",{"$f":"IF(F19=\"\",\"Enter Occupancy\",F19)","v":"R3 Single family dwellings and townhouses"}]
[null,null,null,null,"Code",{"$f":"IFERROR(VLOOKUP(F$796,$E$793:$I$794,2,FALSE),F794)","v":"IRC"}]
[null,null,null,null,"Section",{"$f":"IFERROR(VLOOKUP(F$796,$E$793:$I$794,3,FALSE),G794)","v":"Chapter 15"}]
[null,null,null,null,"Fan Size",{"$f":"VLOOKUP(F$796,$E$793:$I$794,5,FALSE)","v":68.75}]
[]
[]
[]
[]
[null,null,null,null,"DropDown_PercentRunTime",{"$f":"IF(Menu_CodeVersion=\"WSEC 2015\",25%,\"\")","v":""},{"$f":"IF(Menu_CodeVersion=\"WSEC 2015\",33%,\"\")","v":""},0.5,0.66,0.75,1]
[null,null,null,null,null,{"$f":"IF(Menu_CodeVersion=\"WSEC 2015\",4,\"\")","v":""},{"$f":"IF(Menu_CodeVersion=\"WSEC 2015\",3,\"\")","v":""},2,1.5,1.3,1]
[null,null,null,null,"Selected Multiplier",{"$f":"HLOOKUP(F810,F804:K805,2,FALSE)","v":1}]
[]
[null,null,null,null,"Conditioned floor area",{"$f":"IF(H66=\"\",\"Enter Area\",H66)","v":2100}]
[null,null,null,null,{"$f":"'Group R'!E244","v":"Number of Bedrooms "},{"$f":"IF('Group R'!F244=\"\",\"Enter Bedroom\",F244)","v":3}]
[null,null,null,null,{"$f":"'Group R'!E245","v":"Run-Time Percent in Each 4-Hour Segment"},{"$f":"'Group R'!F245","v":1}]
[]
[]
[null,null,null,"IMC, 403.8.1 Minimum Ventilation Performance"]
[null,null,null,null,"https://up.codes/viewer/washington/imc-2015/chapter/4/ventilation#new_403.8.1"]
[null,null,null,null,"Column Offset",{"$f":"IF(F809=\"Enter Bedroom\",F809,SUM(F835:J835))","v":2}]
[null,null,null,null,"Row Offset",{"$f":"IF(F808=\"Enter Area\",F808,SUM(K827:K834))","v":5}]
[null,null,null,null,"Continuous Ventilation Requirement",{"$f":"OFFSET(E826,F816,F815)","v":100}]
[null,null,null,null,"System Coefficeint, Cs",{"$f":"F874","v":1.25}]
[null,null,null,null,"Fan Size ",{"$f":"IFERROR(F817*F806*F818,\"Error\")","v":125}]
[]
[]
[]
[null,null,null,null,null,1,{"$f":"F823+1","v":2},{"$f":"G823+1","v":3},{"$f":"H823+1","v":4},{"$f":"I823+1","v":5}]
[null,null,null,"IMC, 403.8.1 Minimum Ventilation Performance",null,null,null,null,null,null,"row test"]
[null,null,null,null,null,0,2,4,6,8,null,null,null,null,"IRC, TABLE M1505.4.3(1), WHOLE-HOUSE MECHANICAL VENTILATION AIRFLOW RATE"]
[null,null,null,"Greater than","and Less than or equal",1,3,5,7]
[null,null,{"$f":"C826+1","v":1},0,500,30,40,45,55,60,{"$f":"IF(AND($F$808>D827,$F$808<=E827),C827,0)","v":0}]
[null,null,2,{"$f":"E827","v":500},{"$f":"E827+500","v":1000},45,55,60,70,75,0]
[null,null,3,1000,1500,60,70,75,85,90,0]
[null,null,4,1500,2000,75,85,90,100,105,0]
[null,null,5,2000,2500,90,100,105,115,120,5]
[null,null,6,2500,3000,105,115,120,130,135,0]
[null,null,7,3000,3500,120,130,135,145,150,0]
[null,null,8,3500,9999999,135,145,150,160,165,0]
[null,null,null,null,"column test",{"$f":"IF(OR($F$809=F825,$F$809=F826),F823,0)","v":0},{"$f":"IF(OR($F$809=G825,$F$809=G826),G823,0)","v":2},{"$f":"IF(OR($F$809=H825,$F$809=H826),H823,0)","v":0},{"$f":"IF(OR($F$809=I825,$F$809=I826),I823,0)","v":0},{"$f":"IF($F$809>=J825,J823,0)","v":0}]
[]
[null,null,null,"IRC, TABLE M1505.4.3(1), WHOLE-HOUSE MECHANICAL VENTILATION AIRFLOW RATE"]
[null,null,null,null,"Column Offset",{"$f":"IF(F809=\"Enter Bedroom\",F809,SUM(F861:J861))","v":3}]
[null,null,null,null,"Row Offset",{"$f":"IF(F808=\"Enter Area\",F808,SUM(K850:K860))","v":5}]
[null,null,null,null,"Continuous Ventilation Requirement",{"$f":"OFFSET(E849,F839,F838)","v":55}]
[null,null,null,null,"Ventilation Quality Adjustment, Cs",{"$f":"F874","v":1.25}]
[null,null,null,null,"Fan Size ",{"$f":"F840*F806*F841","v":68.75}]
[]
[]
[]
[null,null,null,null,null,1,{"$f":"F846+1","v":2},{"$f":"G846+1","v":3},{"$f":"H846+1","v":4},{"$f":"I846+1","v":5}]
[null,null,null,"IRC, TABLE M1505.4.3(1), WHOLE-HOUSE MECHANICAL VENTILATION AIRFLOW RATE",null,null,null,null,null,null,"row test"]
[null,null,null,null,null,0,2,3,4,5]
[null,null,null,"Greater than","and Less than or equal",1,2,3,4]
[null,null,{"$f":"C849+1","v":1},0,500,30,30,35,45,50,{"$f":"IF(AND($F$808>D850,$F$808<=E850),C850,0)","v":0}]
[null,null,2,{"$f":"E850","v":500},{"$f":"E850+500","v":1000},30,{"$f":"G850+5","v":35},{"$f":"H850+5","v":40},{"$f":"I850+5","v":50},{"$f":"J850+5","v":55},0]
[null,null,3,1000,1500,30,40,45,55,60,0]
[null,null,4,1500,2000,{"$f":"F852+5","v":35},45,50,60,65,0]
[null,null,5,2000,2500,40,50,55,65,70,5]
[null,null,6,2500,3000,45,55,60,70,75,0]
[null,null,7,3000,3500,50,60,65,75,80,0]
[null,null,8,3500,4000,55,65,70,80,85,0]
[null,null,9,4000,4500,60,70,75,85,90,0]
[null,null,10,4500,5000,65,75,80,90,95,0]
[null,null,11,5000,99999999,{"$f":"F859","v":65},{"$f":"G859","v":75},{"$f":"H859","v":80},{"$f":"I859","v":90},{"$f":"J859","v":95},0]
[null,null,null,null,"column test",{"$f":"IF(OR($F$809=F848,$F$809=F849),F846,0)","v":0},{"$f":"IF(OR($F$809=G848,$F$809=G849),G846,0)","v":0},{"$f":"IF(OR($F$809=H848,$F$809=H849),H846,0)","v":3},{"$f":"IF(OR($F$809=I848,$F$809=I849),I846,0)","v":0},{"$f":"IF($F$809>=J848,J846,0)","v":0}]
[]
[null,null,null,"IRC, TABLE M1505.4.3(2) & IMC Table 403.4.3"]
[null,null,null,null,{"$f":"E246","v":"Is the system Balanced?"},null,{"$f":"IF(E873=\"Balanced\",1, 2)","v":1}]
[null,null,null,null,{"$f":"E247","v":"Is the system Distributed?"},{"$f":"F247","v":"Not Distributed"},{"$f":"IF(F865=\"Distributed\",2, 3)","v":3}]
[null,null,null,null,"DropDown_Balanced","Cs from Table M1505.4.3(2)"]
[null,null,null,"DropDown_Distribution",null,"Distributed","Not Distributed"]
[null,null,null,null,"Balanced",1,1.25]
[null,null,null,null,"Unbalanced",1.25,1.5]
[]
[]
[null,null,null,null,null,"Distributed","Not Distributed"]
[null,null,null,null,{"$f":"F246","v":"Balanced"},{"$f":"VLOOKUP($E$873,$E$868:$G$869,2,FALSE)","v":1},{"$f":"VLOOKUP($E$873,$E$868:$G$869,3,FALSE)","v":1.25}]
[null,null,null,null,"Selected Cs",{"$f":"HLOOKUP(F247,F872:G873,2,FALSE)","v":1.25}]
[]
[null,null,null,"TEST if duct testing is required."]
[null,null,null,null,"2018 Is duct testing required?",{"$f":"IF(Menu_HydronicHeatingSystem=\"Yes\",\"No\",IF(Menu_DuctLocation=\"\",\"Select duct location from menu\",IF(Menu_DuctLocation<>MenuItem_UnconditionedSpace,\"No\",IF(ExceptionTotal<>0,\"No\",\"Yes\"))))","v":"Yes"}]
[null,null,null,null,"2021 Is duct testing required?",{"$f":"IF(Menu_HydronicHeatingSystem=\"Yes\",\"No\",IF(Menu_DuctLocation=\"\",\"Select duct location from menu\",IF(Menu_DuctLocation=MenuItem_Unducted,\"No\",IF(ExceptionTotal<>0,\"No\",\"Yes\"))))","v":"Yes"}]
[null,null,null,null,"Selected: is duct testing Required?",{"$f":"IF(Menu_CodeVersion=\"WSEC 2021\",F878,F877)","v":"Yes"}]
[]
[null,null,null,null,"Existing Construction Exceptions","WSEC 2018","WSEC 2021",null,"DropDown_YesNoNA"]
[null,null,null,null,{"$f":"'Group R'!D258","v":"Are ducts systems documented to have been previously sealed as confirmed through field verification and diagnostic testing per RS-33?"},{"$f":"IF('Group R'!G258=\"Yes\",1,0)","v":0},{"$f":"F882","v":0}]
[null,null,null,null,{"$f":"'Group R'!D259","v":"Is there less than 40 linear feet in unconditioned spaces? (not excepted under WSEC 2021)"},{"$f":"IF(AND(Menu_AirHandlerLocation=\"Conditioned Space\",Menu_DuctLocation=\"Conditioned Space\"),1,IF('Group R'!G259=\"Yes\",1,0))","v":0},null,null,"Yes"]
[null,null,null,null,{"$f":"'Group R'!D260","v":"Are existing duct systems constructed, insulated or sealed with asbestos?"},{"$f":"IF('Group R'!G260=\"Yes\",1,0)","v":0},{"$f":"F884","v":0},null,"No"]
[null,null,null,null,{"$f":"'Group R'!D261","v":"Is the project an Addition less than 750 sf of conditioned floor area?"},{"$f":"IF('Group R'!G261=\"Yes\",1,0)","v":0},{"$f":"F885","v":0},null,"NA"]
[null,null,null,null,"Total (zero for new construction)",{"$f":"IF(Menu_ProjectType=\"New Construction\",0,SUM(F882:F885))","v":0},{"$f":"IF(Menu_ProjectType=\"New Construction\",0,SUM(G882:G885))","v":0}]
[null,null,null,null,"Selected Exceptions",{"$f":"IF(Menu_CodeVersion=\"WSEC 2021\",G886,F886)","v":0}]
[]
[null,null,null,null,"Leakage Standard Levels for ducts outside conditioned space"]
[null,null,null,null,"Upper",0.04,"CFM25 per sq. ft.",null,"Changed back to 0.03 and 0.04 from double this.  See email exchange with Jonathan on May 9, 2023."]
[null,null,null,null,"Lower",0.03,"CFM25 per sq. ft."]
[null,null,null,null,"Selected for unconditioned space",{"$f":"IF(F897=\"Yes\",LeakageStandard_Lower,IF(G265=\"Yes\",LeakageStandard_Upper,IF(G266=\"Yes\",LeakageStandard_Upper,LeakageStandard_Lower)))","v":0.04}]
[null,null,null,null,"Leakage Standard Levels for conditioned space",0.08,"CFM25 per sq. ft.",null,{"$f":"IF(F897=\"Yes\",LeakageStandard_Lower,IF(G265=\"Yes\",LeakageStandard_Upper,IF(G266=\"Yes\",LeakageStandard_Upper,LeakageStandard_Lower)))","v":0.04}]
[null,null,null,null,"Selected",{"$f":"IF(AND(Menu_CodeVersion=\"WSEC 2021\",Menu_DuctLocation=\"Conditioned Space\",Menu_AirHandlerLocation=\"Conditioned Space\"),F893,F892)","v":0.04}]
[]
[]
[null,null,null,null,"Is WSEC 2018 and Option 4.1 taken?",{"$f":"IF(OR('Group R'!H56<>\"Option 4.1\",Menu_CodeVersion='Group R'!K400),\"No\",\"Yes\")","v":"No"}]
[]
[]
[null,null,null,null,"Option 4",{"$f":"IF(Menu_ProjectType<>Item_ProjectType_RemodelAlteration,Menu_Option4,\"-\")","v":0},2021,2018]
[null,null,null,null,"Option 4 Error Messages",null,4.0999999999999996,4.2]
[null,null,null,null,"Duct or Distribution System Location",{"$f":"Menu_DuctLocation","v":"Unconditioned Space"},{"$f":"IF(AND(Menu_CodeVersion=K400,Menu_Option4=\"Option 4.1\",F902<>MenuItem_ConditionedSpace),1,0)","v":0},{"$f":"IF(AND(Menu_Option4=\"Option 4.2\",F902<>MenuItem_ConditionedSpace),1,0)","v":0}]
[null,null,null,null,"Air Handler or Boiler Location",{"$f":"G256","v":"Unconditioned Space"},{"$f":"IF(AND(Menu_CodeVersion=K400,Menu_Option4)<>\"Option 4.1\",0,IF($F903=MenuItem_ConditionedSpace,0,1))","v":0},{"$f":"IF(Menu_Option4<>\"Option 4.2\",0,IF($F903=MenuItem_ConditionedSpace,0,1))","v":0}]
[null,null,null,null,"Message",{"$f":"IF(Menu_HydronicHeatingSystem=\"No\",\"Ducts\",\"Distribution System\")","v":"Ducts"},{"$f":"IF(AND(F900=\"Option 4.1\",F902=\"Unconditioned Space\",F905=\"Ducts\"),CONCATENATE(\"Ducts must be in conditioned space to select Option 4.1.\"),\"\")","v":""},{"$f":"IF(H902<>0,CONCATENATE(F905,\" must be located in conditioned space to take Option 4.2\"),\"\")","v":""}]
[null,null,null,null,"Message",{"$f":"IF(Menu_HydronicHeatingSystem=\"No\",\"Ducts\",\"Distribution System\")","v":"Ducts"}]
[null,null,null,null,"Message",{"$f":"IF(Menu_HydronicHeatingSystem=\"Yes\",\"Boiler\",\"Air Handler\")","v":"Air Handler"},{"$f":"IF(AND(Menu_CodeVersion=K400,F900=\"Option 4.1\",F903=\"Unconditioned Space\",F906=\"Air Handler\"),CONCATENATE(\"Air handler must be in conditioned space to select Option 4.1.\"),\"\")","v":""},{"$f":"IF(AND(F900=\"Option 4.2\",F903=\"Unconditioned Space\",F906=\"Air Handler\"),CONCATENATE(\"Air handler must be in conditioned space to select Option 4.2.\"),\"\")","v":""}]
[null,null,null,null,"Concatenated message",null,{"$f":"CONCATENATE(G906,\" -\",G904)","v":" -"},{"$f":"CONCATENATE(H906,\" -\",H904)","v":" -"}]
[null,null,null,null,"SELECTED message",null,{"$f":"IF(Menu_CodeVersion=K400,G907,H907)","v":" -"}]
[]
[]
[]
[null,null,"BELOW GRADE WALL AND SLAB CALCULATIONS"]
[null,null,null,null,"DropDown_SlabDepths"]
[]
[null,null,null,null,"2' depth"]
[null,null,null,null,"3.5' depth"]
[null,null,null,null,"7' depth"]
[]
[null,null,null,"PROPOSED DESIGN - U and F values"]
[null,null,null,null,"Description from Group R","Depth","Search String","Proposed Design","Wall U","Slab F"]
[null,null,null,1,{"$f":"'Group R'!E222","v":0},{"$f":"'Group R'!F222","v":0},{"$f":"IF(AND(E921<>0,F921<>0),CONCATENATE(E921,\", \",F921),\"\")","v":""},{"$f":"VLOOKUP($G921,'Below Grade Walls & Slabs'!$C$4:$G$127,2,FALSE)","v":{"$error":"#N/A"}},{"$f":"VLOOKUP($G921,'Below Grade Walls & Slabs'!$C$4:$G$127,3,FALSE)","v":{"$error":"#N/A"}},{"$f":"VLOOKUP($G921,'Below Grade Walls & Slabs'!$C$4:$G$127,4,FALSE)","v":{"$error":"#N/A"}},null,{"$f":"G921","v":""}]
[null,null,null,2,{"$f":"'Group R'!E223","v":0},{"$f":"'Group R'!F223","v":0},{"$f":"IF(AND(E922<>0,F922<>0),CONCATENATE(E922,\", \",F922),\"\")","v":""},{"$f":"VLOOKUP($G922,'Below Grade Walls & Slabs'!$C$4:$G$127,2,FALSE)","v":{"$error":"#N/A"}},{"$f":"VLOOKUP($G922,'Below Grade Walls & Slabs'!$C$4:$G$127,3,FALSE)","v":{"$error":"#N/A"}},{"$f":"VLOOKUP($G922,'Below Grade Walls & Slabs'!$C$4:$G$127,4,FALSE)","v":{"$error":"#N/A"}}]
[null,null,null,3,{"$f":"'Group R'!E224","v":0},{"$f":"'Group R'!F224","v":0},{"$f":"IF(AND(E923<>0,F923<>0),CONCATENATE(E923,\", \",F923),\"\")","v":""},{"$f":"VLOOKUP($G923,'Below Grade Walls & Slabs'!$C$4:$G$127,2,FALSE)","v":{"$error":"#N/A"}},{"$f":"VLOOKUP($G923,'Below Grade Walls & Slabs'!$C$4:$G$127,3,FALSE)","v":{"$error":"#N/A"}},{"$f":"VLOOKUP($G923,'Below Grade Walls & Slabs'!$C$4:$G$127,4,FALSE)","v":{"$error":"#N/A"}}]
[null,null,null,4,{"$f":"'Group R'!E225","v":0},{"$f":"'Group R'!F225","v":0},{"$f":"IF(AND(E924<>0,F924<>0),CONCATENATE(E924,\", \",F924),\"\")","v":""},{"$f":"VLOOKUP($G924,'Below Grade Walls & Slabs'!$C$4:$G$127,2,FALSE)","v":{"$error":"#N/A"}},{"$f":"VLOOKUP($G924,'Below Grade Walls & Slabs'!$C$4:$G$127,3,FALSE)","v":{"$error":"#N/A"}},{"$f":"VLOOKUP($G924,'Below Grade Walls & Slabs'!$C$4:$G$127,4,FALSE)","v":{"$error":"#N/A"}}]
[]
[null,null,null,"BASELINE DESIGN -- U and F values"]
[null,null,null,null,"Description from Group R","Depth","Search String","BAseline Design","Wall U","Slab F"]
[null,null,null,1,{"$f":"'Group R'!T222","v":0},{"$f":"'Group R'!U222","v":0},{"$f":"IF(AND(E928<>0,F928<>0),CONCATENATE(E928,\", \",F928),\"\")","v":""},{"$f":"VLOOKUP($G928,'Below Grade Walls & Slabs'!$C$4:$G$127,2,FALSE)","v":{"$error":"#N/A"}},{"$f":"VLOOKUP($G928,'Below Grade Walls & Slabs'!$C$4:$G$127,3,FALSE)","v":{"$error":"#N/A"}},{"$f":"VLOOKUP($G928,'Below Grade Walls & Slabs'!$C$4:$G$127,4,FALSE)","v":{"$error":"#N/A"}}]
[null,null,null,2,{"$f":"'Group R'!T223","v":0},{"$f":"'Group R'!U223","v":0},{"$f":"IF(AND(E929<>0,F929<>0),CONCATENATE(E929,\", \",F929),\"\")","v":""},{"$f":"VLOOKUP($G929,'Below Grade Walls & Slabs'!$C$4:$G$127,2,FALSE)","v":{"$error":"#N/A"}},{"$f":"VLOOKUP($G929,'Below Grade Walls & Slabs'!$C$4:$G$127,3,FALSE)","v":{"$error":"#N/A"}},{"$f":"VLOOKUP($G929,'Below Grade Walls & Slabs'!$C$4:$G$127,4,FALSE)","v":{"$error":"#N/A"}}]
[null,null,null,3,{"$f":"'Group R'!T224","v":0},{"$f":"'Group R'!U224","v":0},{"$f":"IF(AND(E930<>0,F930<>0),CONCATENATE(E930,\", \",F930),\"\")","v":""},{"$f":"VLOOKUP($G930,'Below Grade Walls & Slabs'!$C$4:$G$127,2,FALSE)","v":{"$error":"#N/A"}},{"$f":"VLOOKUP($G930,'Below Grade Walls & Slabs'!$C$4:$G$127,3,FALSE)","v":{"$error":"#N/A"}},{"$f":"VLOOKUP($G930,'Below Grade Walls & Slabs'!$C$4:$G$127,4,FALSE)","v":{"$error":"#N/A"}}]
[null,null,null,4,{"$f":"'Group R'!T225","v":0},{"$f":"'Group R'!U225","v":0},{"$f":"IF(AND(E931<>0,F931<>0),CONCATENATE(E931,\", \",F931),\"\")","v":""},{"$f":"VLOOKUP($G931,'Below Grade Walls & Slabs'!$C$4:$G$127,2,FALSE)","v":{"$error":"#N/A"}},{"$f":"VLOOKUP($G931,'Below Grade Walls & Slabs'!$C$4:$G$127,3,FALSE)","v":{"$error":"#N/A"}},{"$f":"VLOOKUP($G931,'Below Grade Walls & Slabs'!$C$4:$G$127,4,FALSE)","v":{"$error":"#N/A"}}]
[]
[null,null,null,"CODE BASELINE  -- U and F values"]
[null,null,null,null,"Code Baseline","Depth","Search String","BAseline Design","Wall U","Slab F","Area","Perim","UA","FP"]
[null,null,null,1,{"$f":"IF(Menu_CodeVersion=$E$941,$E$942,$E$944)","v":"R21 Batt w/TB"},{"$f":"F921","v":0},{"$f":"IF(AND(E935<>0,F935<>0),CONCATENATE(E935,\", \",F935),\"\")","v":""},{"$f":"VLOOKUP($G935,'Below Grade Walls & Slabs'!$C$4:$G$127,2,FALSE)","v":{"$error":"#N/A"}},{"$f":"IFERROR(VLOOKUP($G935,'Below Grade Walls & Slabs'!$C$4:$G$127,3,FALSE),\"\")","v":""},{"$f":"IFERROR(VLOOKUP($G935,'Below Grade Walls & Slabs'!$C$4:$G$127,4,FALSE),\"\")","v":""},{"$f":"IF(I222=\"\",\"\",I222)","v":""},{"$f":"IF(M222=\"\",\"\",M222)","v":""},{"$f":"IFERROR(K935*I935,\"\")","v":""},{"$f":"IFERROR(L935*J935,\"\")","v":""}]
[null,null,null,2,{"$f":"IF(Menu_CodeVersion=$E$941,$E$942,$E$944)","v":"R21 Batt w/TB"},{"$f":"F922","v":0},{"$f":"IF(AND(E936<>0,F936<>0),CONCATENATE(E936,\", \",F936),\"\")","v":""},{"$f":"VLOOKUP($G936,'Below Grade Walls & Slabs'!$C$4:$G$127,2,FALSE)","v":{"$error":"#N/A"}},{"$f":"IFERROR(VLOOKUP($G936,'Below Grade Walls & Slabs'!$C$4:$G$127,3,FALSE),\"\")","v":""},{"$f":"IFERROR(VLOOKUP($G936,'Below Grade Walls & Slabs'!$C$4:$G$127,4,FALSE),\"\")","v":""},{"$f":"IF(I223=\"\",\"\",I223)","v":""},{"$f":"IF(M223=\"\",\"\",M223)","v":""},{"$f":"IFERROR(K936*I936,\"\")","v":""},{"$f":"IFERROR(L936*J936,\"\")","v":""}]
[null,null,null,3,{"$f":"IF(Menu_CodeVersion=$E$941,$E$942,$E$944)","v":"R21 Batt w/TB"},{"$f":"F923","v":0},{"$f":"IF(AND(E937<>0,F937<>0),CONCATENATE(E937,\", \",F937),\"\")","v":""},{"$f":"VLOOKUP($G937,'Below Grade Walls & Slabs'!$C$4:$G$127,2,FALSE)","v":{"$error":"#N/A"}},{"$f":"IFERROR(VLOOKUP($G937,'Below Grade Walls & Slabs'!$C$4:$G$127,3,FALSE),\"\")","v":""},{"$f":"IFERROR(VLOOKUP($G937,'Below Grade Walls & Slabs'!$C$4:$G$127,4,FALSE),\"\")","v":""},{"$f":"IF(I224=\"\",\"\",I224)","v":""},{"$f":"IF(M224=\"\",\"\",M224)","v":""},"",""]
[null,null,null,4,{"$f":"IF(Menu_CodeVersion=$E$941,$E$942,$E$944)","v":"R21 Batt w/TB"},{"$f":"F924","v":0},{"$f":"IF(AND(E938<>0,F938<>0),CONCATENATE(E938,\", \",F938),\"\")","v":""},{"$f":"VLOOKUP($G938,'Below Grade Walls & Slabs'!$C$4:$G$127,2,FALSE)","v":{"$error":"#N/A"}},{"$f":"IFERROR(VLOOKUP($G938,'Below Grade Walls & Slabs'!$C$4:$G$127,3,FALSE),\"\")","v":""},{"$f":"IFERROR(VLOOKUP($G938,'Below Grade Walls & Slabs'!$C$4:$G$127,4,FALSE),\"\")","v":""},{"$f":"IF(I225=\"\",\"\",I225)","v":""},{"$f":"IF(M225=\"\",\"\",M225)","v":""},"",""]
[null,null,null,null,null,null,null,null,null,null,null,"Weighted Averages",{"$f":"IFERROR(SUM(M935:M938)/SUM(K935:K938),\"N/A\")","v":"N/A"},{"$f":"IFERROR(SUM(N935:N938)/SUM(L935:L938),\"N/A\")","v":"N/A"}]
[]
[null,null,null,null,{"$f":"$K$400","v":"WSEC 2021"}]
[null,null,null,null,{"$f":"'Below Grade Walls & Slabs'!C189","v":"R21 Batt w/TB"}]
[null,null,null,null,{"$f":"$K$401","v":"WSEC 2018"}]
[null,null,null,null,{"$f":"'Below Grade Walls & Slabs'!C189","v":"R21 Batt w/TB"}]

{"sheet":"Vertical Glazing","index":6,"n_rows":384,"n_cols":6,"rows_kept":384,"cut":false,"hidden":true,"merged":[]}
["WSU Code Compliance Calculator  - WSEC 2015 &2018",null,null,null,null,"(C) 2020"]
["Vertical Glazing Database"]
["Index","Component Description","Reference","Glazing U"]
[]
[1]
[{"$f":"A5+1","v":2},"=== Most Frequently Used ========= "]
[3,"1gl Wood/Vinyl Clear","10-6A",1.2]
[4,"2gl Wood/vinyl, Low-e2 ½\"","10-6B",0.4]
[5,"3gl Wood/vinyl, Low-e2 ½\" + argon (Code Baseline)","10-6B",0.3]
[6,"3gl Wood/vinyl, Low-e1 ½\" + argon","10-6B",0.28999999999999998]
[7,"U=0.30 (Code Baseline)","Table 406.2 / 406.3",0.3]
[8,"U=0.29",null,0.28999999999999998]
[9,"U=0.28 (2018 1.3, 1.7)","Table 406.2 / 406.3",0.28000000000000003]
[10,"U=0.27",null,0.27,"Added Dec 2021"]
[11,"U=0.25 (2021 1.2; 2018 1.4)","Table 406.2 / 406.3",0.25]
[12,"U=0.24 (2018 1.1)","Table 406.2 / 406.3",0.24]
[13,"U=0.22 (2021 1.1; 2018 1.5)","Table 406.2 / 406.3",0.22]
[14,"U=0.20 (2018 1.2)","Table 406.2 / 406.3",0.2,"Corrected Dec 2021"]
[15,"U=0.18 (2021 1.3, 1.4; 2018 1.6)","Table 406.2 / 406.3",0.18]
[16,"Default Metal, Single Pane","Table R303.1.3(1)",1.2]
[17,"Default Metal, Double Pane","Table R303.1.3(1)",0.8]
[18,"Default Metal w/TB, Single Pane","Table R303.1.3(1)",2.2000000000000002]
[19,"Default Metal w/TB, Double Pane","Table R303.1.3(1)",0.65]
[20,"Default Nonmetal or Metal Clad, Single Pane","Table R303.1.3(1)",0.95]
[21,"Default Nonmetal or Metal Clad, Double Pane","Table R303.1.3(1)",0.55000000000000004]
[22,"Default Glazed Block","Table R303.1.3(1)",0.6]
[23,"2021 U-factor Baseline (Table R402.1.2)","Table R402.1.2",0.3]
[24,"============================="]
[25,"1gl Wood/Vinyl Clear","10-6A",1.2]
[26,"2gl Wood/Vinyl Clear <1/2\" spacer","10-6A",0.63]
[27,"2gl Wood/Vinyl Clear+Argon <1/2\"spacer","10-6A",0.6]
[28,"2gl Wood/Vinyl LowE <1/2\"spacer","10-6A",0.57999999999999996]
[29,"2gl Wood/Vinyl LowE+Argon <1/2\"spacer","10-6A",0.53]
[30,"2gl Wood/Vinyl Clear ≥1/2\"spacer","10-6A",0.57999999999999996]
[{"$f":"A34+1","v":31},"2gl Wood/Vinyl Clear+Argon ≥1/2\"spacer","10-6A",0.55000000000000004]
[32,"2gl Wood/Vinyl LowE ≥1/2\"spacer","10-6A",0.51]
[33,"2gl Wood/Vinyl LowE+Argon ≥1/2\"spacer","10-6A",0.48]
[34,"3gl Wood/Vinyl Clear","10-6A",0.43]
[35,"3gl Wood/Vinyl Clear+Argon","10-6A",0.41]
[36,"3gl Wood/Vinyl LowE","10-6A",0.4]
[37,"3gl Wood/Vinyl LowE+Argon","10-6A",0.37]
[38,"1gl Garden Wood/Vinyl Clear","10-6A",2.31]
[39,"2gl Garden Wood/Vinyl Clear","10-6A",1.61]
[40,"2gl Garden Wood/Vinyl Clear+Argon","10-6A",1.56]
[41,"2gl Garden Wood/Vinyl LowE+Argon","10-6A",1.54]
[42,"2gl Garden Wood/Vinyl LowE+Argon","10-6A",1.47]
[43,"1gl Alum with TB Clear","10-6A",1.2]
[44,"2gl Alum with TB Clear <1/2\" spacer","10-6A",0.75]
[45,"2gl Alum with TB Clear+Argon <1/2\"spacer","10-6A",0.71]
[46,"2gl Alum with TB LowE <1/2\"spacer","10-6A",0.69]
[47,"2gl Alum with TB LowE+Argon <1/2\"spacer","10-6A",0.62]
[48,"2gl Alum with TB Clear ≥1/2\"spacer","10-6A",0.69]
[49,"2gl Alum with TB Clear+Argon ≥1/2\"spacer","10-6A",0.67]
[50,"2gl Alum with TB LowE ≥1/2\"spacer","10-6A",0.61]
[51,"2gl Alum with TB LowE+Argon ≥1/2\"spacer","10-6A",0.57999999999999996]
[52,"3gl Alum with TB Clear","10-6A",0.53]
[53,"3gl Alum with TB Clear+Argon","10-6A",0.52]
[54,"3gl Alum with TB LowE","10-6A",0.49]
[55,"3gl Alum with TB LowE+Argon","10-6A",0.47]
[56,"1gl Aluminum Clear","10-6A",1.2]
[57,"2gl Aluminum Clear <1/2\" spacer","10-6A",0.92]
[58,"2gl Aluminum Clear+Argon <1/2\"spacer","10-6A",0.87]
[59,"2gl Aluminum LowE <1/2\"spacer","10-6A",0.85]
[60,"2gl Aluminum LowE+Argon <1/2\"spacer","10-6A",0.79]
[61,"2gl Aluminum Clear ≥1/2\"spacer","10-6A",0.86]
[62,"2gl Aluminum Clear+Argon ≥1/2\"spacer","10-6A",0.83]
[63,"2gl Aluminum LowE ≥1/2\"spacer","10-6A",0.78]
[64,"2gl Aluminum LowE+Argon ≥1/2\"spacer","10-6A",0.75]
[65,"3gl Aluminum Clear","10-6A",0.7]
[66,"3gl Aluminum Clear+Argon","10-6A",0.69]
[67,"3gl Aluminum LowE","10-6A",0.67]
[68,"3gl Aluminum LowE+Argon","10-6A",0.63]
[69,"1gl Garden Aluminum Clear","10-6A",2.6]
[70,"2gl Garden Aluminum Clear","10-6A",1.81]
[71,"2gl Garden Aluminum Clear+Argon","10-6A",1.76]
[72,"2gl Garden Aluminum LowE+Argon","10-6A",1.73]
[73,"2gl Garden Aluminum LowE+Argon","10-6A",1.64]
[74,"Glass Block","10-6A",0.51]
[75,"2gl Alum clad wood, Clear ¼\"","10-6B",0.59]
[76,"2gl Alum clad wood, Clear ¼\" + argon","10-6B",0.56000000000000005]
[77,"2gl Alum clad wood, Low-e4 ¼\"","10-6B",0.54]
[78,"2gl Alum clad wood, Low-e2 ¼\"","10-6B",0.51]
[79,"2gl Alum clad wood, Low-e1 ¼\"","10-6B",0.49]
[80,"2gl Alum clad wood, Low-e4 ¼\" + argon","10-6B",0.49]
[81,"2gl Alum clad wood, Low-e2 ¼\" + argon","10-6B",0.46]
[82,"2gl Alum clad wood, Low-e1 ¼\" + argon","10-6B",0.43]
[83,"2gl Alum clad wood, Clear 3/8\"","10-6B",0.56999999999999995]
[84,"2gl Alum clad wood, Clear 3/8\" + argon","10-6B",0.54]
[85,"2gl Alum clad wood, Low-e4 3/8\"","10-6B",0.51]
[86,"2gl Alum clad wood, Low-e2 3/8\"","10-6B",0.48]
[87,"2gl Alum clad wood, Low-e1 3/8\"","10-6B",0.46]
[88,"2gl Alum clad wood, Low-e4 3/8\" + argon","10-6B",0.47]
[89,"2gl Alum clad wood, Low-e2 3/8\" + argon","10-6B",0.44]
[{"$f":"A93+1","v":90},"2gl Alum clad wood, Low-e1 3/8\" + argon","10-6B",0.41]
[91,"2gl Alum clad wood, Clear ½\"","10-6B",0.54]
[92,"2gl Alum clad wood, Clear ½\" + argon","10-6B",0.51]
[93,"2gl Alum clad wood, Low-e4 ½\"","10-6B",0.47]
[94,"2gl Alum clad wood, Low-e2 ½\"","10-6B",0.44]
[95,"2gl Alum clad wood, Low-e1 ½\"","10-6B",0.42]
[96,"2gl Alum clad wood, Low-e4 ½\" + argon","10-6B",0.44]
[97,"2gl Alum clad wood, Low-e2 ½\" + argon","10-6B",0.4]
[98,"2gl Alum clad wood, Low-e1 ½\" + argon","10-6B",0.38]
[99,"3gl Alum clad wood, Clear ¼\"","10-6B",0.44]
[100,"3gl Alum clad wood, Clear ¼\" + argon","10-6B",0.42]
[101,"3gl Alum clad wood, Low-e4 ¼\"","10-6B",0.4]
[102,"3gl Alum clad wood, Low-e2 ¼\"","10-6B",0.41]
[103,"3gl Alum clad wood, Low-e1 ¼\"","10-6B",0.4]
[104,"3gl Alum clad wood, Low-e4 ¼\" + argon","10-6B",0.39]
[105,"3gl Alum clad wood, Low-e2 ¼\" + argon","10-6B",0.37]
[106,"3gl Alum clad wood, Low-e1 ¼\" + argon","10-6B",0.36]
[107,"3gl Alum clad wood, Clear ½\"","10-6B",0.4]
[108,"3gl Alum clad wood, Clear ½\" + argon","10-6B",0.38]
[109,"3gl Alum clad wood, Low-e4 ½\"","10-6B",0.37]
[110,"3gl Alum clad wood, Low-e2 ½\"","10-6B",0.35]
[111,"3gl Alum clad wood, Low-e1 ½\"","10-6B",0.33]
[112,"3gl Alum clad wood, Low-e4 ½\" + argon","10-6B",0.35]
[113,"3gl Alum clad wood, Low-e2 ½\" + argon","10-6B",0.32]
[114,"3gl Alum clad wood, Low-e1 ½\" + argon","10-6B",0.31]
[115,"2gl Wood/vinyl, Clear ¼\"","10-6B",0.56000000000000005]
[116,"2gl Wood/vinyl, Clear ¼\" + argon","10-6B",0.53]
[117,"2gl Wood/vinyl, Low-e4 ¼\"","10-6B",0.52]
[118,"2gl Wood/vinyl, Low-e2 ¼\"","10-6B",0.49]
[119,"2gl Wood/vinyl, Low-e1 ¼\"","10-6B",0.47]
[120,"2gl Wood/vinyl, Low-e4 ¼\" + argon","10-6B",0.47]
[121,"2gl Wood/vinyl, Low-e2 ¼\" + argon","10-6B",0.43]
[122,"2gl Wood/vinyl, Low-e1 ¼\" + argon","10-6B",0.41]
[123,"2gl Wood/vinyl, Clear 3/8\"","10-6B",0.54]
[124,"2gl Wood/vinyl, Clear 3/8\" + argon","10-6B",0.51]
[125,"2gl Wood/vinyl, Low-e4 3/8\"","10-6B",0.48]
[126,"2gl Wood/vinyl, Low-e2 3/8\"","10-6B",0.45]
[127,"2gl Wood/vinyl, Low-e1 3/8\"","10-6B",0.43]
[128,"2gl Wood/vinyl, Low-e4 3/8\" + argon","10-6B",0.44]
[129,"2gl Wood/vinyl, Low-e2 3/8\" + argon","10-6B",0.41]
[130,"2gl Wood/vinyl, Low-e1 3/8\" + argon","10-6B",0.39]
[131,"2gl Wood/vinyl, Clear ½\"","10-6B",0.5]
[132,"2gl Wood/vinyl, Clear ½\" + argon","10-6B",0.48]
[133,"2gl Wood/vinyl, Low-e4 ½\"","10-6B",0.44]
[134,"2gl Wood/vinyl, Low-e2 ½\"","10-6B",0.4]
[135,"2gl Wood/vinyl, Low-e1 ½\"","10-6B",0.35]
[136,"2gl Wood/vinyl, Low-e4 ½\" + argon","10-6B",0.42]
[137,"2gl Wood/vinyl, Low-e2 ½\" + argon","10-6B",0.37]
[138,"2gl Wood/vinyl, Low-e1 ½\" + argon","10-6B",0.35]
[139,"3gl Wood/vinyl, Clear ¼\"","10-6B",0.42]
[140,"3gl Wood/vinyl, Clear ¼\" + argon","10-6B",0.39]
[141,"3gl Wood/vinyl, Low-e4 ¼\"","10-6B",0.4]
[142,"3gl Wood/vinyl, Low-e2 ¼\"","10-6B",0.39]
[143,"3gl Wood/vinyl, Low-e1 ¼\"","10-6B",0.38]
[144,"3gl Wood/vinyl, Low-e4 ¼\" + argon","10-6B",0.37]
[145,"3gl Wood/vinyl, Low-e2 ¼\" + argon","10-6B",0.34]
[146,"3gl Wood/vinyl, Low-e1 ¼\" + argon","10-6B",0.34]
[147,"3gl Wood/vinyl, Clear ½\"","10-6B",0.37]
[148,"3gl Wood/vinyl, Clear ½\" + argon","10-6B",0.36]
[149,"3gl Wood/vinyl, Low-e4 ½\"","10-6B",0.35]
[150,"3gl Wood/vinyl, Low-e2 ½\"","10-6B",0.32]
[151,"3gl Wood/vinyl, Low-e1 ½\"","10-6B",0.31]
[152,"3gl Wood/vinyl, Low-e4 ½\" + argon","10-6B",0.32]
[153,"3gl Wood/vinyl, Low-e2 ½\" + argon","10-6B",0.3]
[{"$f":"A157+1","v":154},"3gl Wood/vinyl, Low-e1 ½\" + argon","10-6B",0.28999999999999998]
[155,"2gl Alum with TB, Clear ¼\"","10-6B",0.66]
[156,"2gl Alum with TB, Clear ¼\" + argon","10-6B",0.63]
[157,"2gl Alum with TB, Low-e4 ¼\"","10-6B",0.61]
[158,"2gl Alum with TB, Low-e2 ¼\"","10-6B",0.57999999999999996]
[159,"2gl Alum with TB, Low-e1 ¼\"","10-6B",0.55000000000000004]
[160,"2gl Alum with TB, Low-e4 ¼\" + argon","10-6B",0.55000000000000004]
[161,"2gl Alum with TB, Low-e2 ¼\" + argon","10-6B",0.52]
[162,"2gl Alum with TB, Low-e1 ¼\" + argon","10-6B",0.5]
[163,"2gl Alum with TB, Clear 3/8\"","10-6B",0.63]
[164,"2gl Alum with TB, Clear 3/8\" + argon","10-6B",0.6]
[165,"2gl Alum with TB, Low-e4 3/8\"","10-6B",0.56999999999999995]
[166,"2gl Alum with TB, Low-e2 3/8\"","10-6B",0.54]
[167,"2gl Alum with TB, Low-e1 3/8\"","10-6B",0.51]
[168,"2gl Alum with TB, Low-e4 3/8\" + argon","10-6B",0.53]
[169,"2gl Alum with TB, Low-e2 3/8\" + argon","10-6B",0.49]
[170,"2gl Alum with TB, Low-e1 3/8\" + argon","10-6B",0.47]
[171,"2gl Alum with TB, Clear ½\"","10-6B",0.6]
[172,"2gl Alum with TB, Clear ½\" + argon","10-6B",0.57999999999999996]
[173,"2gl Alum with TB, Low-e4 ½\"","10-6B",0.53]
[174,"2gl Alum with TB, Low-e2 ½\"","10-6B",0.5]
[175,"2gl Alum with TB, Low-e1 ½\"","10-6B",0.47]
[176,"2gl Alum with TB, Low-e4 ½\" + argon","10-6B",0.5]
[177,"2gl Alum with TB, Low-e2 ½\" + argon","10-6B",0.46]
[178,"2gl Alum with TB, Low-e1 ½\" + argon","10-6B",0.43]
[179,"3gl Alum with TB, Clear ¼\"","10-6B",0.52]
[180,"3gl Alum with TB, Clear ¼\" + argon","10-6B",0.49]
[181,"3gl Alum with TB, Low-e4 ¼\"","10-6B",0.5]
[182,"3gl Alum with TB, Low-e2 ¼\"","10-6B",0.48]
[183,"3gl Alum with TB, Low-e1 ¼\"","10-6B",0.47]
[184,"3gl Alum with TB, Low-e4 ¼\" + argon","10-6B",0.46]
[185,"3gl Alum with TB, Low-e2 ¼\" + argon","10-6B",0.43]
[186,"3gl Alum with TB, Low-e1 ¼\" + argon","10-6B",0.42]
[187,"3gl Alum with TB, Clear ½\"","10-6B",0.46]
[188,"3gl Alum with TB, Clear ½\" + argon","10-6B",0.45]
[189,"3gl Alum with TB, Low-e4 ½\"","10-6B",0.43]
[190,"3gl Alum with TB, Low-e2 ½\"","10-6B",0.41]
[191,"3gl Alum with TB, Low-e1 ½\"","10-6B",0.39]
[192,"3gl Alum with TB, Low-e4 ½\" + argon","10-6B",0.41]
[193,"3gl Alum with TB, Low-e2 ½\" + argon","10-6B",0.38]
[194,"3gl Alum with TB, Low-e1 ½\" + argon","10-6B",0.37]
[195,"2gl Aluminum, Clear ¼\"","10-6B",0.82]
[196,"2gl Aluminum, Clear ¼\" + argon","10-6B",0.77]
[197,"2gl Aluminum, Low-e4 ¼\"","10-6B",0.76]
[198,"2gl Aluminum, Low-e2 ¼\"","10-6B",0.73]
[199,"2gl Aluminum, Low-e1 ¼\"","10-6B",0.7]
[200,"2gl Aluminum, Low-e4 ¼\" + argon","10-6B",0.7]
[201,"2gl Aluminum, Low-e2 ¼\" + argon","10-6B",0.66]
[202,"2gl Aluminum, Low-e1 ¼\" + argon","10-6B",0.64]
[203,"2gl Aluminum, Clear 3/8\"","10-6B",0.78]
[204,"2gl Aluminum, Clear 3/8\" + argon","10-6B",0.75]
[205,"2gl Aluminum, Low-e4 3/8\"","10-6B",0.72]
[206,"2gl Aluminum, Low-e2 3/8\"","10-6B",0.69]
[207,"2gl Aluminum, Low-e1 3/8\"","10-6B",0.66]
[208,"2gl Aluminum, Low-e4 3/8\" + argon","10-6B",0.68]
[209,"2gl Aluminum, Low-e2 3/8\" + argon","10-6B",0.63]
[210,"2gl Aluminum, Low-e1 3/8\" + argon","10-6B",0.61]
[211,"2gl Aluminum, Clear ½\"","10-6B",0.75]
[212,"2gl Aluminum, Clear ½\" + argon","10-6B",0.72]
[213,"2gl Aluminum, Low-e4 ½\"","10-6B",0.68]
[214,"2gl Aluminum, Low-e2 ½\"","10-6B",0.64]
[215,"2gl Aluminum, Low-e1 ½\"","10-6B",0.61]
[216,"2gl Aluminum, Low-e4 ½\" + argon","10-6B",0.65]
[217,"2gl Aluminum, Low-e2 ½\" + argon","10-6B",0.6]
[{"$f":"A221+1","v":218},"2gl Aluminum, Low-e1 ½\" + argon","10-6B",0.57999999999999996]
[219,"3gl Aluminum, Clear ¼\"","10-6B",0.66]
[220,"3gl Aluminum, Clear ¼\" + argon","10-6B",0.63]
[221,"3gl Aluminum, Low-e4 ¼\"","10-6B",0.64]
[222,"3gl Aluminum, Low-e2 ¼\"","10-6B",0.62]
[223,"3gl Aluminum, Low-e1 ¼\"","10-6B",0.61]
[224,"3gl Aluminum, Low-e4 ¼\" + argon","10-6B",0.6]
[225,"3gl Aluminum, Low-e2 ¼\" + argon","10-6B",0.57999999999999996]
[226,"3gl Aluminum, Low-e1 ¼\" + argon","10-6B",0.56999999999999995]
[227,"3gl Aluminum, Clear ½\"","10-6B",0.61]
[228,"3gl Aluminum, Clear ½\" + argon","10-6B",0.59]
[229,"3gl Aluminum, Low-e4 ½\"","10-6B",0.57999999999999996]
[230,"3gl Aluminum, Low-e2 ½\"","10-6B",0.55000000000000004]
[231,"3gl Aluminum, Low-e1 ½\"","10-6B",0.54]
[232,"3gl Aluminum, Low-e4 ½\" + argon","10-6B",0.55000000000000004]
[233,"3gl Aluminum, Low-e2 ½\" + argon","10-6B",0.52]
[234,"3gl Aluminum, Low-e1 ½\" + argon","10-6B",0.51]
[235,"=== Custom Entries: Use NFRC Tested U-Values  ================",null,"U-Value","Notes",{"$f":"'Flat-Vaulted Ceilings'!$F$339","v":"Your entries appear at bottom of drowdown menus on \"Group R\" tab"}]
[236,"MIL-A-299-00054-00001","Custom",0.34,"Milgard",{"$f":"IF(AND(B241<>\"\",B240=\"\"),\"Don't skip lines\",IF(AND(D240=\"\",B240<>\"\"),\"Enter U-value\",IF(AND(D240<>\"\",B240=\"\"),\"Enter Description\",\"\")))","v":""}]
[237,"Sliding Door","Custom",0.28999999999999998,null,""]
[238,"window test","Custom",1,null,""]
[239,"Operable Window (U-0.28)","Custom",0.28000000000000003,null,""]
[240,"Fixed Window (U-0.27)","Custom",0.27,null,""]
[241,null,"Custom",null,null,""]
[242,null,"Custom",null,null,""]
[243,null,"Custom",null,null,""]
[244,null,"Custom",null,null,""]
[245,null,"Custom",null,null,""]
[246,null,"Custom",null,null,""]
[247,null,"Custom",null,null,""]
[248,null,"Custom",null,null,""]
[249,null,"Custom",null,null,""]
[250,null,"Custom",null,null,""]
[251,null,"Custom",null,null,""]
[252,null,"Custom",null,null,""]
[253,null,"Custom",null,null,""]
[254,null,"Custom",null,null,""]
[255,null,"Custom",null,null,""]
[256,null,"Custom",null,null,""]
[257,null,"Custom",null,null,""]
[258,null,"Custom",null,null,""]
[259,null,"Custom",null,null,""]
[260,null,"Custom",null,null,""]
[261,null,"Custom",null,null,""]
[262,null,"Custom",null,null,""]
[263,null,"Custom",null,null,""]
[264,null,"Custom",null,null,""]
[265,null,"Custom",null,null,""]
[266,null,"Custom",null,null,""]
[267,null,"Custom",null,null,""]
[268,null,"Custom",null,null,""]
[269,null,"Custom",null,null,""]
[270,null,"Custom",null,null,""]
[271,null,"Custom",null,null,""]
[272,null,"Custom",null,null,""]
[273,null,"Custom",null,null,""]
[274,null,"Custom",null,null,""]
[275,null,"Custom",null,null,""]
[276,null,"Custom",null,null,""]
[277,null,"Custom",null,null,""]
[278,null,"Custom",null,null,""]
[279,null,"Custom",null,null,""]
[280,null,"Custom",null,null,""]
[281,null,"Custom",null,null,""]
[282,null,"Custom",null,null,""]
[{"$f":"A286+1","v":283},null,"Custom",null,null,""]
[284,null,"Custom",null,null,""]
[285,null,"Custom",null,null,""]
[286,null,"Custom",null,null,""]
[287,null,"Custom",null,null,""]
[288,null,"Custom",null,null,""]
[289,null,"Custom",null,null,""]
[290,null,"Custom",null,null,""]
[291,null,"Custom",null,null,""]
[292,null,"Custom",null,null,""]
[293,null,"Custom",null,null,""]
[294,null,"Custom",null,null,""]
[295,null,"Custom",null,null,""]
[296,null,"Custom",null,null,""]
[297,null,"Custom",null,null,""]
[298,null,"Custom",null,null,""]
[299,null,"Custom",null,null,""]
[300,null,"Custom",null,null,{"$f":"IF(AND(B305<>\"\",B304=\"\"),\"Don't skip lines\",IF(AND(D304=\"\",B304<>\"\"),\"Enter U-value\",IF(AND(D304<>\"\",B304=\"\"),\"Enter Description\",\"\")))","v":""}]
[301,null,"Custom",null,null,""]
[302,null,"Custom",null,null,""]
[303,null,"Custom",null,null,""]
[304,null,"Custom",null,null,""]
[305,null,"Custom",null,null,""]
[306,null,"Custom",null,null,""]
[307,null,"Custom",null,null,""]
[308,null,"Custom",null,null,""]
[309,null,"Custom",null,null,""]
[310,null,"Custom",null,null,""]
[311,null,"Custom",null,null,""]
[312,null,"Custom",null,null,""]
[313,null,"Custom",null,null,""]
[314,null,"Custom",null,null,""]
[315,null,"Custom",null,null,""]
[316,null,"Custom",null,null,""]
[317,null,"Custom",null,null,""]
[318,null,"Custom",null,null,""]
[319,null,"Custom",null,null,""]
[320,null,"Custom",null,null,""]
[321,null,"Custom",null,null,""]
[322,null,"Custom",null,null,""]
[323,null,"Custom",null,null,""]
[324,null,"Custom",null,null,""]
[325,null,"Custom",null,null,""]
[326,null,"Custom",null,null,""]
[327,null,"Custom",null,null,""]
[328,null,"Custom",null,null,""]
[329,null,"Custom",null,null,""]
[330,null,"Custom",null,null,""]
[331,null,"Custom",null,null,""]
[332,null,"Custom",null,null,""]
[333,null,"Custom",null,null,""]
[334,null,"Custom",null,null,""]
[335,null,"Custom",null,null,""]
[336,null,"Custom",null,null,""]
[337,null,"Custom",null,null,""]
[338,null,"Custom",null,null,""]
[339,null,"Custom",null,null,""]
[340,null,"Custom",null,null,""]
[341,null,"Custom",null,null,""]
[342,null,"Custom",null,null,""]
[343,null,"Custom",null,null,""]
[344,null,"Custom",null,null,""]
[345,null,"Custom",null,null,""]
[346,null,"Custom",null,null,""]
[{"$f":"A350+1","v":347},null,"Custom",null,null,""]
[348,null,"Custom",null,null,""]
[349,null,"Custom",null,null,""]
[350,null,"Custom",null,null,""]
[351,null,"Custom",null,null,""]
[352,null,"Custom",null,null,""]
[353,null,"Custom",null,null,""]
[354,null,"Custom",null,null,""]
[355,null,"Custom",null,null,""]
[356,null,"Custom",null,null,""]
[357,null,"Custom",null,null,""]
[358,null,"Custom",null,null,""]
[359,null,"Custom",null,null,""]
[360,null,"Custom",null,null,""]
[361,null,"Custom",null,null,""]
[362,null,"Custom",null,null,""]
[363,null,"Custom",null,null,""]
[364,null,"Custom",null,null,{"$f":"IF(AND(B369<>\"\",B368=\"\"),\"Don't skip lines\",IF(AND(D368=\"\",B368<>\"\"),\"Enter U-value\",IF(AND(D368<>\"\",B368=\"\"),\"Enter Description\",\"\")))","v":""}]
[365,null,"Custom",null,null,""]
[366,null,"Custom",null,null,""]
[367,null,"Custom",null,null,""]
[368,null,"Custom",null,null,""]
[369,null,"Custom",null,null,""]
[370,null,"Custom",null,null,""]
[371,null,"Custom",null,null,""]
[372,null,"Custom",null,null,""]
[373,null,"Custom",null,null,""]
[374,null,"Custom",null,null,""]
[375,null,"Custom",null,null,""]
[376,null,"Custom",null,null,""]
[377,null,"Custom",null,null,""]
[378,null,"Custom",null,null,""]
[379,null,"Custom",null,null,""]
[380,null,"Custom",null,null,""]

{"sheet":"Overhead Glazing","index":7,"n_rows":2020,"n_cols":6,"rows_kept":2020,"cut":false,"hidden":true,"merged":[]}
["WSU Code Compliance Calculator  - WSEC 2015 &2018",null,null,null,null,"(C) 2020"]
["Overhead Glazing Database"]
["Index","Component Description","Reference","Glazing U"]
[]
[1]
[{"$f":"A5+1","v":2},"=== Most Frequently Used ========= "]
[3,"1gl wood glass","10-6E",1.18]
[4,"2gl wood, e=0.05 argon (Code Baseline)","10-6E",0.5]
[5,"3gl wood, e=0.20 air","10-6E",0.47]
[6,"3gl wood, e=0.20 argon","10-6E",0.43]
[7,"3gl wood, e=0.20 on 2 surfaces air","10-6E",0.44]
[8,"3gl wood, e=0.20 on 2 surfaces argon","10-6E",0.4]
[9,"3gl wood, e=0.10 on 2 surfaces air","10-6E",0.42]
[10,"3gl wood, e=0.10 on 2 surfaces argon","10-6E",0.38]
[11,"4gl wood, e=0.10 on 2 surfaces air","10-6E",0.39]
[12,"4gl wood, e=0.10 on 2 surfaces argon","10-6E",0.36]
[13,"4gl wood, e=0.10 on 2 surfaces krypton","10-6E",0.32]
[14,"4gl Alum clad wood, e=0.10 on 2 surf krypton","10-6E",0.48]
[15,"2021 U-factor Baseline (Table R402.1.2)","Table R402.1.2",0.5]
[16,"============================="]
[17,"1gl wood glass","10-6E",1.18]
[18,"1gl wood acrylic/polycarb","10-6E",1.1100000000000001]
[19,"2gl wood clear air","10-6E",0.67]
[20,"2gl wood clear argon","10-6E",0.64]
[21,"2gl wood, e=0.20 air","10-6E",0.59]
[22,"2gl wood, e=0.20 argon","10-6E",0.54]
[23,"2gl wood, e=0.10 air","10-6E",0.57999999999999996]
[24,"2gl wood, e=0.10 argon","10-6E",0.52]
[25,"2gl wood, e=0.05 air","10-6E",0.56000000000000005]
[26,"2gl wood, e=0.05 argon","10-6E",0.5]
[27,"3gl wood clear air","10-6E",0.51]
[28,"3gl wood clear argon","10-6E",0.48]
[29,"3gl wood, e=0.20 air","10-6E",0.47]
[30,"3gl wood, e=0.20 argon","10-6E",0.43]
[31,"3gl wood, e=0.20 on 2 surfaces air","10-6E",0.44]
[32,"3gl wood, e=0.20 on 2 surfaces argon","10-6E",0.4]
[33,"3gl wood, e=0.10 on 2 surfaces air","10-6E",0.42]
[34,"3gl wood, e=0.10 on 2 surfaces argon","10-6E",0.38]
[35,"4gl wood, e=0.10 on 2 surfaces air","10-6E",0.39]
[36,"4gl wood, e=0.10 on 2 surfaces argon","10-6E",0.36]
[37,"4gl wood, e=0.10 on 2 surfaces krypton","10-6E",0.32]
[38,"1gl Alum clad wood glass","10-6E",1.4]
[39,"1gl Alum clad wood acrylic/polycarb","10-6E",1.34]
[40,"2gl Alum clad wood clear air","10-6E",0.84]
[41,"2gl Alum clad wood clear argon","10-6E",0.8]
[42,"2gl Alum clad wood, e=0.20 air","10-6E",0.75]
[43,"2gl Alum clad wood, e=0.20 argon","10-6E",0.7]
[44,"2gl Alum clad wood, e=0.10 air","10-6E",0.74]
[45,"2gl Alum clad wood, e=0.10 argon","10-6E",0.68]
[46,"2gl Alum clad wood, e=0.05 air","10-6E",0.73]
[47,"2gl Alum clad wood, e=0.05 argon","10-6E",0.66]
[48,"3gl Alum clad wood clear air","10-6E",0.67]
[49,"3gl Alum clad wood clear argon","10-6E",0.64]
[50,"3gl Alum clad wood, e=0.20 air","10-6E",0.63]
[51,"3gl Alum clad wood, e=0.20 argon","10-6E",0.59]
[52,"3gl Alum clad wood, e=0.20 on 2 surf air","10-6E",0.6]
[53,"3gl Alum clad wood, e=0.20 on 2 surf argon","10-6E",0.56000000000000005]
[54,"3gl Alum clad wood, e=0.10 on 2 surf air","10-6E",0.57999999999999996]
[55,"3gl Alum clad wood, e=0.10 on 2 surf argon","10-6E",0.54]
[56,"4gl Alum clad wood, e=0.10 on 2 surf air","10-6E",0.55000000000000004]
[57,"4gl Alum clad wood, e=0.10 on 2 surf argon","10-6E",0.52]
[58,"4gl Alum clad wood, e=0.10 on 2 surf krypton","10-6E",0.48]
[59,"1gl Alum with TB glass","10-6E",1.51]
[60,"1gl Alum with TB acrylic/polycarb","10-6E",1.45]
[61,"2gl Alum with TB clear air","10-6E",0.89]
[{"$f":"A65+1","v":62},"2gl Alum with TB clear argon","10-6E",0.86]
[63,"2gl Alum with TB, e=0.20 air","10-6E",0.8]
[64,"2gl Alum with TB, e=0.20 argon","10-6E",0.75]
[65,"2gl Alum with TB, e=0.10 air","10-6E",0.79]
[66,"2gl Alum with TB, e=0.10 argon","10-6E",0.73]
[67,"2gl Alum with TB, e=0.05 air","10-6E",0.78]
[68,"2gl Alum with TB, e=0.05 argon","10-6E",0.71]
[69,"3gl Alum with TB clear air","10-6E",0.7]
[70,"3gl Alum with TB clear argon","10-6E",0.69]
[71,"3gl Alum with TB, e=0.20 air","10-6E",0.68]
[72,"3gl Alum with TB, e=0.20 argon","10-6E",0.63]
[73,"3gl Alum with TB, e=0.20 on 2 surf air","10-6E",0.64]
[74,"3gl Alum with TB, e=0.20 on 2 surf argon","10-6E",0.6]
[75,"3gl Alum with TB, e=0.10 on 2 surfaces air","10-6E",0.62]
[76,"3gl Alum with TB, e=0.10 on 2 surf argon","10-6E",0.57999999999999996]
[77,"4gl Alum with TB, e=0.10 on 2 surfaces air","10-6E",0.59]
[78,"4gl Alum with TB, e=0.10 on 2 surf argon","10-6E",0.56000000000000005]
[79,"4gl Alum with TB, e=0.10 on 2 surf krypton","10-6E",0.52]
[80,"1gl Aluminum glass","10-6E",1.58]
[81,"1gl Aluminum acrylic/polycarb","10-6E",1.52]
[82,"2gl Aluminum clear air","10-6E",1.05]
[83,"2gl Aluminum clear argon","10-6E",1.02]
[84,"2gl Aluminum, e=0.20 air","10-6E",0.96]
[85,"2gl Aluminum, e=0.20 argon","10-6E",0.91]
[86,"2gl Aluminum, e=0.10 air","10-6E",0.94]
[87,"2gl Aluminum, e=0.10 argon","10-6E",0.89]
[88,"2gl Aluminum, e=0.05 air","10-6E",0.93]
[89,"2gl Aluminum, e=0.05 argon","10-6E",0.87]
[90,"3gl Aluminum clear air","10-6E",0.9]
[91,"3gl Aluminum clear argon","10-6E",0.87]
[92,"3gl Aluminum, e=0.20 air","10-6E",0.86]
[93,"3gl Aluminum, e=0.20 argon","10-6E",0.82]
[94,"3gl Aluminum, e=0.20 on 2 surf air","10-6E",0.82]
[95,"3gl Aluminum, e=0.20 on 2 surf argon","10-6E",0.79]
[96,"3gl Aluminum, e=0.10 on 2 surf air","10-6E",0.81]
[97,"3gl Aluminum, e=0.10 on 2 surf argon","10-6E",0.77]
[98,"4gl Aluminum, e=0.10 on 2 surf air","10-6E",0.78]
[99,"4gl Aluminum, e=0.10 on 2 surf argon","10-6E",0.74]
[100,"4gl Aluminum, e=0.10 on 2 surf krypton","10-6E",0.7]
[101,"=== Custom Entries: Use NFRC Tested Values  ================",null,"U-Value","Notes",{"$f":"'Flat-Vaulted Ceilings'!$F$339","v":"Your entries appear at bottom of drowdown menus on \"Group R\" tab"}]
[102,"Custom skylight","Custom",0.25,null,{"$f":"IF(AND(B107<>\"\",B106=\"\"),\"Don't skip lines\",IF(AND(D106=\"\",B106<>\"\"),\"Enter U-value\",IF(AND(D106<>\"\",B106=\"\"),\"Enter Description\",\"\")))","v":""}]
[103,"test","Custom",1,null,""]
[104,null,"Custom",null,null,""]
[105,null,"Custom",null,null,""]
[106,null,"Custom",null,null,""]
[107,null,"Custom",null,null,""]
[108,null,"Custom",null,null,""]
[109,null,"Custom",null,null,""]
[110,null,"Custom",null,null,""]
[111,null,"Custom",null,null,""]
[112,null,"Custom",null,null,""]
[113,null,"Custom",null,null,""]
[114,null,"Custom",null,null,""]
[115,null,"Custom",null,null,""]
[116,null,"Custom",null,null,""]
[117,null,"Custom",null,null,""]
[118,null,"Custom",null,null,""]
[119,null,"Custom",null,null,""]
[120,null,"Custom",null,null,""]
[121,null,"Custom",null,null,""]
[122,null,"Custom",null,null,""]
[123,null,"Custom",null,null,""]
[124,null,"Custom",null,null,""]
[125,null,"Custom",null,null,""]
[126,null,"Custom",null,null,""]
[{"$f":"A130+1","v":127},null,"Custom",null,null,""]
[128,null,"Custom",null,null,""]
[129,null,"Custom",null,null,""]
[130,null,"Custom",null,null,""]
[131,null,"Custom",null,null,""]
[132,null,"Custom",null,null,""]
[133,null,"Custom",null,null,""]
[134,null,"Custom",null,null,""]
[135,null,"Custom",null,null,""]
[136,null,"Custom",null,null,""]
[137,null,"Custom",null,null,""]
[138,null,"Custom",null,null,""]
[139,null,"Custom",null,null,""]
[140,null,"Custom",null,null,""]
[141,null,"Custom",null,null,""]
[142,null,"Custom",null,null,""]
[143,null,"Custom",null,null,""]
[144,null,"Custom",null,null,""]
[145,null,"Custom",null,null,""]
[146,null,"Custom",null,null,""]
[147,null,"Custom",null,null,""]
[148,null,"Custom",null,null,""]
[149,null,"Custom",null,null,""]
[150,null,"Custom",null,null,""]
[151,null,"Custom",null,null,""]
[152,null,"Custom",null,null,""]
[153,null,"Custom",null,null,""]
[154,null,"Custom",null,null,""]
[155,null,"Custom",null,null,""]
[156,null,"Custom",null,null,""]
[157,null,"Custom",null,null,""]
[158,null,"Custom",null,null,""]
[159,null,"Custom",null,null,""]
[160,null,"Custom",null,null,""]
[161,null,"Custom",null,null,""]
[162,null,"Custom",null,null,""]
[163,null,"Custom",null,null,""]
[164,null,"Custom",null,null,""]
[165,null,"Custom",null,null,""]
[166,null,"Custom",null,null,{"$f":"IF(AND(B171<>\"\",B170=\"\"),\"Don't skip lines\",IF(AND(D170=\"\",B170<>\"\"),\"Enter U-value\",IF(AND(D170<>\"\",B170=\"\"),\"Enter Description\",\"\")))","v":""}]
[167,null,"Custom",null,null,""]
[168,null,"Custom",null,null,""]
[169,null,"Custom",null,null,""]
[170,null,"Custom",null,null,""]
[171,null,"Custom",null,null,""]
[172,null,"Custom",null,null,""]
[173,null,"Custom",null,null,""]
[174,null,"Custom",null,null,""]
[175,null,"Custom",null,null,""]
[176,null,"Custom",null,null,""]
[177,null,"Custom",null,null,""]
[178,null,"Custom",null,null,""]
[179,null,"Custom",null,null,""]
[180,null,"Custom",null,null,""]
[181,null,"Custom",null,null,""]
[182,null,"Custom",null,null,""]
[183,null,"Custom",null,null,""]
[184,null,"Custom",null,null,""]
[185,null,"Custom",null,null,""]
[186,null,"Custom",null,null,""]
[187,null,"Custom",null,null,""]
[188,null,"Custom",null,null,""]
[189,null,"Custom",null,null,""]
[190,null,"Custom",null,null,""]
[{"$f":"A194+1","v":191},null,"Custom",null,null,""]
[192,null,"Custom",null,null,""]
[193,null,"Custom",null,null,""]
[194,null,"Custom",null,null,""]
[195,null,"Custom",null,null,""]
[196,null,"Custom",null,null,""]
[197,null,"Custom",null,null,""]
[198,null,"Custom",null,null,""]
[199,null,"Custom",null,null,""]
[200,null,"Custom",null,null,""]
[201,null,"Custom",null,null,""]
[202,null,"Custom",null,null,""]
[203,null,"Custom",null,null,""]
[204,null,"Custom",null,null,""]
[205,null,"Custom",null,null,""]
[206,null,"Custom",null,null,""]
[207,null,"Custom",null,null,""]
[208,null,"Custom",null,null,""]
[209,null,"Custom",null,null,""]
[210,null,"Custom",null,null,""]
[211,null,"Custom",null,null,""]
[212,null,"Custom",null,null,""]
[213,null,"Custom",null,null,""]
[214,null,"Custom",null,null,""]
[215,null,"Custom",null,null,""]
[216,null,"Custom",null,null,""]
[217,null,"Custom",null,null,""]
[218,null,"Custom",null,null,""]
[219,null,"Custom",null,null,""]
[220,null,"Custom",null,null,""]
[221,null,"Custom",null,null,""]
[222,null,"Custom",null,null,""]
[223,null,"Custom",null,null,""]
[224,null,"Custom",null,null,""]
[225,null,"Custom",null,null,""]
[226,null,"Custom",null,null,""]
[227,null,"Custom",null,null,""]
[228,null,"Custom",null,null,""]
[229,null,"Custom",null,null,""]
[230,null,"Custom",null,null,{"$f":"IF(AND(B235<>\"\",B234=\"\"),\"Don't skip lines\",IF(AND(D234=\"\",B234<>\"\"),\"Enter U-value\",IF(AND(D234<>\"\",B234=\"\"),\"Enter Description\",\"\")))","v":""}]
[231,null,"Custom",null,null,""]
[232,null,"Custom",null,null,""]
[233,null,"Custom",null,null,""]
[234,null,"Custom",null,null,""]
[235,null,"Custom",null,null,""]
[236,null,"Custom",null,null,""]
[237,null,"Custom",null,null,""]
[238,null,"Custom",null,null,""]
[239,null,"Custom",null,null,""]
[240,null,"Custom",null,null,""]
[241,null,"Custom",null,null,""]
[242,null,"Custom",null,null,""]
[243,null,"Custom",null,null,""]
[244,null,"Custom",null,null,""]
[245,null,"Custom",null,null,""]
[246,null,"Custom",null,null,""]
[247,null,"Custom",null,null,""]
[248,null,"Custom",null,null,""]
[249,null,"Custom",null,null,""]
[250,null,"Custom",null,null,""]
[251,null,"Custom",null,null,""]
[252,null,"Custom",null,null,""]
[253,null,"Custom",null,null,""]
[254,null,"Custom",null,null,""]
[{"$f":"A258+1","v":255},null,"Custom",null,null,""]
[256,null,"Custom",null,null,""]
[257,null,"Custom",null,null,""]
[258,null,"Custom",null,null,""]
[259,null,"Custom",null,null,""]
[260,null,"Custom",null,null,""]
[261,null,"Custom",null,null,""]
[262,null,"Custom",null,null,""]
[263,null,"Custom",null,null,""]
[264,null,"Custom",null,null,""]
[265,null,"Custom",null,null,""]
[266,null,"Custom",null,null,""]
[267,null,"Custom",null,null,""]
[268,null,"Custom",null,null,""]
[269,null,"Custom",null,null,""]
[270,null,"Custom",null,null,""]
[271,null,"Custom",null,null,""]
[272,null,"Custom",null,null,""]
[273,null,"Custom",null,null,""]
[274,null,"Custom",null,null,""]
[275,null,"Custom",null,null,""]
[276,null,"Custom",null,null,""]
[277,null,"Custom",null,null,""]
[278,null,"Custom",null,null,""]
[279,null,"Custom",null,null,""]
[280,null,"Custom",null,null,""]
[281,null,"Custom",null,null,""]
[282,null,"Custom",null,null,""]
[283,null,"Custom",null,null,""]
[284,null,"Custom",null,null,""]
[285,null,"Custom",null,null,""]
[286,null,"Custom",null,null,""]
[287,null,"Custom",null,null,""]
[288,null,"Custom",null,null,""]
[289,null,"Custom",null,null,""]
[290,null,"Custom",null,null,""]
[291,null,"Custom",null,null,""]
[292,null,"Custom",null,null,""]
[293,null,"Custom",null,null,""]
[294,null,"Custom",null,null,{"$f":"IF(AND(B299<>\"\",B298=\"\"),\"Don't skip lines\",IF(AND(D298=\"\",B298<>\"\"),\"Enter U-value\",IF(AND(D298<>\"\",B298=\"\"),\"Enter Description\",\"\")))","v":""}]
[295,null,"Custom",null,null,""]
[296,null,"Custom",null,null,""]
[297,null,"Custom",null,null,""]
[298,null,"Custom",null,null,""]
[299,null,"Custom",null,null,""]
[300,null,"Custom",null,null,""]
[301,null,"Custom",null,null,""]
[302,null,"Custom",null,null,""]
[303,null,"Custom",null,null,""]
[304,null,"Custom",null,null,""]
[305,null,"Custom",null,null,""]
[306,null,"Custom",null,null,""]
[307,null,"Custom",null,null,""]
[308,null,"Custom",null,null,""]
[309,null,"Custom",null,null,""]
[310,null,"Custom",null,null,""]
[311,null,"Custom",null,null,""]
[312,null,"Custom",null,null,""]
[313,null,"Custom",null,null,""]
[314,null,"Custom",null,null,""]
[315,null,"Custom",null,null,""]
[316,null,"Custom",null,null,""]
[317,null,"Custom",null,null,""]
[318,null,"Custom",null,null,""]
[{"$f":"A322+1","v":319},null,"Custom",null,null,""]
[320,null,"Custom",null,null,""]
[321,null,"Custom",null,null,""]
[322,null,"Custom",null,null,""]
[323,null,"Custom",null,null,""]
[324,null,"Custom",null,null,""]
[325,null,"Custom",null,null,""]
[326,null,"Custom",null,null,""]
[327,null,"Custom",null,null,""]
[328,null,"Custom",null,null,""]
[329,null,"Custom",null,null,""]
[330,null,"Custom",null,null,""]
[331,null,"Custom",null,null,""]
[332,null,"Custom",null,null,""]
[333,null,"Custom",null,null,""]
[334,null,"Custom",null,null,""]
[335,null,"Custom",null,null,""]
[336,null,"Custom",null,null,""]
[337,null,"Custom",null,null,""]
[338,null,"Custom",null,null,""]
[339,null,"Custom",null,null,""]
[340,null,"Custom",null,null,""]
[341,null,"Custom",null,null,""]
[342,null,"Custom",null,null,""]
[343,null,"Custom",null,null,""]
[344,null,"Custom",null,null,""]
[345,null,"Custom",null,null,""]
[346,null,"Custom",null,null,""]
[347,null,"Custom",null,null,""]
[348,null,"Custom",null,null,""]
[349,null,"Custom",null,null,""]
[350,null,"Custom",null,null,""]
[351,null,"Custom",null,null,""]
[352,null,"Custom",null,null,""]
[353,null,"Custom",null,null,""]
[354,null,"Custom",null,null,""]
[355,null,"Custom",null,null,""]
[356,null,"Custom",null,null,""]
[357,null,"Custom",null,null,""]
[358,null,"Custom",null,null,{"$f":"IF(AND(B363<>\"\",B362=\"\"),\"Don't skip lines\",IF(AND(D362=\"\",B362<>\"\"),\"Enter U-value\",IF(AND(D362<>\"\",B362=\"\"),\"Enter Description\",\"\")))","v":""}]
[359,null,"Custom",null,null,""]
[360,null,"Custom",null,null,""]
[361,null,"Custom",null,null,""]
[362,null,"Custom",null,null,""]
[363,null,"Custom",null,null,""]
[364,null,"Custom",null,null,""]
[365,null,"Custom",null,null,""]
[366,null,"Custom",null,null,""]
[367,null,"Custom",null,null,""]
[368,null,"Custom",null,null,""]
[369,null,"Custom",null,null,""]
[370,null,"Custom",null,null,""]
[371,null,"Custom",null,null,""]
[372,null,"Custom",null,null,""]
[373,null,"Custom",null,null,""]
[374,null,"Custom",null,null,""]
[375,null,"Custom",null,null,""]
[376,null,"Custom",null,null,""]
[377,null,"Custom",null,null,""]
[378,null,"Custom",null,null,""]
[379,null,"Custom",null,null,""]
[380,null,"Custom",null,null,""]
[381,null,"Custom",null,null,""]
[382,null,"Custom",null,null,""]
[{"$f":"A386+1","v":383},null,"Custom",null,null,""]
[384,null,"Custom",null,null,""]
[385,null,"Custom",null,null,""]
[386,null,"Custom",null,null,""]
[387,null,"Custom",null,null,""]
[388,null,"Custom",null,null,""]
[389,null,"Custom",null,null,""]
[390,null,"Custom",null,null,""]
[391,null,"Custom",null,null,""]
[392,null,"Custom",null,null,""]
[393,null,"Custom",null,null,""]
[394,null,"Custom",null,null,""]
[395,null,"Custom",null,null,""]
[396,null,"Custom",null,null,""]
[397,null,"Custom",null,null,""]
[398,null,"Custom",null,null,""]
[399,null,"Custom",null,null,""]
[400,null,"Custom",null,null,""]
[401,null,"Custom",null,null,""]
[402,null,"Custom",null,null,""]
[403,null,"Custom",null,null,""]
[404,null,"Custom",null,null,""]
[405,null,"Custom",null,null,""]
[406,null,"Custom",null,null,""]
[407,null,"Custom",null,null,""]
[408,null,"Custom",null,null,""]
[409,null,"Custom",null,null,""]
[410,null,"Custom",null,null,""]
[411,null,"Custom",null,null,""]
[412,null,"Custom",null,null,""]
[413,null,"Custom",null,null,""]
[414,null,"Custom",null,null,""]
[415,null,"Custom",null,null,""]
[416,null,"Custom",null,null,""]
[417,null,"Custom",null,null,""]
[418,null,"Custom",null,null,""]
[419,null,"Custom",null,null,""]
[420,null,"Custom",null,null,""]
[421,null,"Custom",null,null,""]
[422,null,"Custom",null,null,{"$f":"IF(AND(B427<>\"\",B426=\"\"),\"Don't skip lines\",IF(AND(D426=\"\",B426<>\"\"),\"Enter U-value\",IF(AND(D426<>\"\",B426=\"\"),\"Enter Description\",\"\")))","v":""}]
[423,null,"Custom",null,null,""]
[424,null,"Custom",null,null,""]
[425,null,"Custom",null,null,""]
[426,null,"Custom",null,null,""]
[427,null,"Custom",null,null,""]
[428,null,"Custom",null,null,""]
[429,null,"Custom",null,null,""]
[430,null,"Custom",null,null,""]
[431,null,"Custom",null,null,""]
[432,null,"Custom",null,null,""]
[433,null,"Custom",null,null,""]
[434,null,"Custom",null,null,""]
[435,null,"Custom",null,null,""]
[436,null,"Custom",null,null,""]
[437,null,"Custom",null,null,""]
[438,null,"Custom",null,null,""]
[439,null,"Custom",null,null,""]
[440,null,"Custom",null,null,""]
[441,null,"Custom",null,null,""]
[442,null,"Custom",null,null,""]
[443,null,"Custom",null,null,""]
[444,null,"Custom",null,null,""]
[445,null,"Custom",null,null,""]
[446,null,"Custom",null,null,""]
[{"$f":"A450+1","v":447},null,"Custom",null,null,""]
[448,null,"Custom",null,null,""]
[449,null,"Custom",null,null,""]
[450,null,"Custom",null,null,""]
[451,null,"Custom",null,null,""]
[452,null,"Custom",null,null,""]
[453,null,"Custom",null,null,""]
[454,null,"Custom",null,null,""]
[455,null,"Custom",null,null,""]
[456,null,"Custom",null,null,""]
[457,null,"Custom",null,null,""]
[458,null,"Custom",null,null,""]
[459,null,"Custom",null,null,""]
[460,null,"Custom",null,null,""]
[461,null,"Custom",null,null,""]
[462,null,"Custom",null,null,""]
[463,null,"Custom",null,null,""]
[464,null,"Custom",null,null,""]
[465,null,"Custom",null,null,""]
[466,null,"Custom",null,null,""]
[467,null,"Custom",null,null,""]
[468,null,"Custom",null,null,""]
[469,null,"Custom",null,null,""]
[470,null,"Custom",null,null,""]
[471,null,"Custom",null,null,""]
[472,null,"Custom",null,null,""]
[473,null,"Custom",null,null,""]
[474,null,"Custom",null,null,""]
[475,null,"Custom",null,null,""]
[476,null,"Custom",null,null,""]
[477,null,"Custom",null,null,""]
[478,null,"Custom",null,null,""]
[479,null,"Custom",null,null,""]
[480,null,"Custom",null,null,""]
[481,null,"Custom",null,null,""]
[482,null,"Custom",null,null,""]
[483,null,"Custom",null,null,""]
[484,null,"Custom",null,null,""]
[485,null,"Custom",null,null,""]
[486,null,"Custom",null,null,{"$f":"IF(AND(B491<>\"\",B490=\"\"),\"Don't skip lines\",IF(AND(D490=\"\",B490<>\"\"),\"Enter U-value\",IF(AND(D490<>\"\",B490=\"\"),\"Enter Description\",\"\")))","v":""}]
[487,null,"Custom",null,null,""]
[488,null,"Custom",null,null,""]
[489,null,"Custom",null,null,""]
[490,null,"Custom",null,null,""]
[491,null,"Custom",null,null,""]
[492,null,"Custom",null,null,""]
[493,null,"Custom",null,null,""]
[494,null,"Custom",null,null,""]
[495,null,"Custom",null,null,""]
[496,null,"Custom",null,null,""]
[497,null,"Custom",null,null,""]
[498,null,"Custom",null,null,""]
[499,null,"Custom",null,null,""]
[500,null,"Custom",null,null,""]
[501,null,"Custom",null,null,""]
[502,null,"Custom",null,null,""]
[503,null,"Custom",null,null,""]
[504,null,"Custom",null,null,""]
[505,null,"Custom",null,null,""]
[506,null,"Custom",null,null,""]
[507,null,"Custom",null,null,""]
[508,null,"Custom",null,null,""]
[509,null,"Custom",null,null,""]
[510,null,"Custom",null,null,""]
[{"$f":"A514+1","v":511},null,"Custom",null,null,""]
[512,null,"Custom",null,null,""]
[513,null,"Custom",null,null,""]
[514,null,"Custom",null,null,""]
[515,null,"Custom",null,null,""]
[516,null,"Custom",null,null,""]
[517,null,"Custom",null,null,""]
[518,null,"Custom",null,null,""]
[519,null,"Custom",null,null,""]
[520,null,"Custom",null,null,""]
[521,null,"Custom",null,null,""]
[522,null,"Custom",null,null,""]
[523,null,"Custom",null,null,""]
[524,null,"Custom",null,null,""]
[525,null,"Custom",null,null,""]
[526,null,"Custom",null,null,""]
[527,null,"Custom",null,null,""]
[528,null,"Custom",null,null,""]
[529,null,"Custom",null,null,""]
[530,null,"Custom",null,null,""]
[531,null,"Custom",null,null,""]
[532,null,"Custom",null,null,""]
[533,null,"Custom",null,null,""]
[534,null,"Custom",null,null,""]
[535,null,"Custom",null,null,""]
[536,null,"Custom",null,null,""]
[537,null,"Custom",null,null,""]
[538,null,"Custom",null,null,""]
[539,null,"Custom",null,null,""]
[540,null,"Custom",null,null,""]
[541,null,"Custom",null,null,""]
[542,null,"Custom",null,null,""]
[543,null,"Custom",null,null,""]
[544,null,"Custom",null,null,""]
[545,null,"Custom",null,null,""]
[546,null,"Custom",null,null,""]
[547,null,"Custom",null,null,""]
[548,null,"Custom",null,null,""]
[549,null,"Custom",null,null,""]
[550,null,"Custom",null,null,{"$f":"IF(AND(B555<>\"\",B554=\"\"),\"Don't skip lines\",IF(AND(D554=\"\",B554<>\"\"),\"Enter U-value\",IF(AND(D554<>\"\",B554=\"\"),\"Enter Description\",\"\")))","v":""}]
[551,null,"Custom",null,null,""]
[552,null,"Custom",null,null,""]
[553,null,"Custom",null,null,""]
[554,null,"Custom",null,null,""]
[555,null,"Custom",null,null,""]
[556,null,"Custom",null,null,""]
[557,null,"Custom",null,null,""]
[558,null,"Custom",null,null,""]
[559,null,"Custom",null,null,""]
[560,null,"Custom",null,null,""]
[561,null,"Custom",null,null,""]
[562,null,"Custom",null,null,""]
[563,null,"Custom",null,null,""]
[564,null,"Custom",null,null,""]
[565,null,"Custom",null,null,""]
[566,null,"Custom",null,null,""]
[567,null,"Custom",null,null,""]
[568,null,"Custom",null,null,""]
[569,null,"Custom",null,null,""]
[570,null,"Custom",null,null,""]
[571,null,"Custom",null,null,""]
[572,null,"Custom",null,null,""]
[573,null,"Custom",null,null,""]
[574,null,"Custom",null,null,""]
[{"$f":"A578+1","v":575},null,"Custom",null,null,""]
[576,null,"Custom",null,null,""]
[577,null,"Custom",null,null,""]
[578,null,"Custom",null,null,""]
[579,null,"Custom",null,null,""]
[580,null,"Custom",null,null,""]
[581,null,"Custom",null,null,""]
[582,null,"Custom",null,null,""]
[583,null,"Custom",null,null,""]
[584,null,"Custom",null,null,""]
[585,null,"Custom",null,null,""]
[586,null,"Custom",null,null,""]
[587,null,"Custom",null,null,""]
[588,null,"Custom",null,null,""]
[589,null,"Custom",null,null,""]
[590,null,"Custom",null,null,""]
[591,null,"Custom",null,null,""]
[592,null,"Custom",null,null,""]
[593,null,"Custom",null,null,""]
[594,null,"Custom",null,null,""]
[595,null,"Custom",null,null,""]
[596,null,"Custom",null,null,""]
[597,null,"Custom",null,null,""]
[598,null,"Custom",null,null,""]
[599,null,"Custom",null,null,""]
[600,null,"Custom",null,null,""]
[601,null,"Custom",null,null,""]
[602,null,"Custom",null,null,""]
[603,null,"Custom",null,null,""]
[604,null,"Custom",null,null,""]
[605,null,"Custom",null,null,""]
[606,null,"Custom",null,null,""]
[607,null,"Custom",null,null,""]
[608,null,"Custom",null,null,""]
[609,null,"Custom",null,null,""]
[610,null,"Custom",null,null,""]
[611,null,"Custom",null,null,""]
[612,null,"Custom",null,null,""]
[613,null,"Custom",null,null,""]
[614,null,"Custom",null,null,{"$f":"IF(AND(B619<>\"\",B618=\"\"),\"Don't skip lines\",IF(AND(D618=\"\",B618<>\"\"),\"Enter U-value\",IF(AND(D618<>\"\",B618=\"\"),\"Enter Description\",\"\")))","v":""}]
[615,null,"Custom",null,null,""]
[616,null,"Custom",null,null,""]
[617,null,"Custom",null,null,""]
[618,null,"Custom",null,null,""]
[619,null,"Custom",null,null,""]
[620,null,"Custom",null,null,""]
[621,null,"Custom",null,null,""]
[622,null,"Custom",null,null,""]
[623,null,"Custom",null,null,""]
[624,null,"Custom",null,null,""]
[625,null,"Custom",null,null,""]
[626,null,"Custom",null,null,""]
[627,null,"Custom",null,null,""]
[628,null,"Custom",null,null,""]
[629,null,"Custom",null,null,""]
[630,null,"Custom",null,null,""]
[631,null,"Custom",null,null,""]
[632,null,"Custom",null,null,""]
[633,null,"Custom",null,null,""]
[634,null,"Custom",null,null,""]
[635,null,"Custom",null,null,""]
[636,null,"Custom",null,null,""]
[637,null,"Custom",null,null,""]
[638,null,"Custom",null,null,""]
[{"$f":"A642+1","v":639},null,"Custom",null,null,""]
[640,null,"Custom",null,null,""]
[641,null,"Custom",null,null,""]
[642,null,"Custom",null,null,""]
[643,null,"Custom",null,null,""]
[644,null,"Custom",null,null,""]
[645,null,"Custom",null,null,""]
[646,null,"Custom",null,null,""]
[647,null,"Custom",null,null,""]
[648,null,"Custom",null,null,""]
[649,null,"Custom",null,null,""]
[650,null,"Custom",null,null,""]
[651,null,"Custom",null,null,""]
[652,null,"Custom",null,null,""]
[653,null,"Custom",null,null,""]
[654,null,"Custom",null,null,""]
[655,null,"Custom",null,null,""]
[656,null,"Custom",null,null,""]
[657,null,"Custom",null,null,""]
[658,null,"Custom",null,null,""]
[659,null,"Custom",null,null,""]
[660,null,"Custom",null,null,""]
[661,null,"Custom",null,null,""]
[662,null,"Custom",null,null,""]
[663,null,"Custom",null,null,""]
[664,null,"Custom",null,null,""]
[665,null,"Custom",null,null,""]
[666,null,"Custom",null,null,""]
[667,null,"Custom",null,null,""]
[668,null,"Custom",null,null,""]
[669,null,"Custom",null,null,""]
[670,null,"Custom",null,null,""]
[671,null,"Custom",null,null,""]
[672,null,"Custom",null,null,""]
[673,null,"Custom",null,null,""]
[674,null,"Custom",null,null,""]
[675,null,"Custom",null,null,""]
[676,null,"Custom",null,null,""]
[677,null,"Custom",null,null,""]
[678,null,"Custom",null,null,{"$f":"IF(AND(B683<>\"\",B682=\"\"),\"Don't skip lines\",IF(AND(D682=\"\",B682<>\"\"),\"Enter U-value\",IF(AND(D682<>\"\",B682=\"\"),\"Enter Description\",\"\")))","v":""}]
[679,null,"Custom",null,null,""]
[680,null,"Custom",null,null,""]
[681,null,"Custom",null,null,""]
[682,null,"Custom",null,null,""]
[683,null,"Custom",null,null,""]
[684,null,"Custom",null,null,""]
[685,null,"Custom",null,null,""]
[686,null,"Custom",null,null,""]
[687,null,"Custom",null,null,""]
[688,null,"Custom",null,null,""]
[689,null,"Custom",null,null,""]
[690,null,"Custom",null,null,""]
[691,null,"Custom",null,null,""]
[692,null,"Custom",null,null,""]
[693,null,"Custom",null,null,""]
[694,null,"Custom",null,null,""]
[695,null,"Custom",null,null,""]
[696,null,"Custom",null,null,""]
[697,null,"Custom",null,null,""]
[698,null,"Custom",null,null,""]
[699,null,"Custom",null,null,""]
[700,null,"Custom",null,null,""]
[701,null,"Custom",null,null,""]
[702,null,"Custom",null,null,""]
[{"$f":"A706+1","v":703},null,"Custom",null,null,""]
[704,null,"Custom",null,null,""]
[705,null,"Custom",null,null,""]
[706,null,"Custom",null,null,""]
[707,null,"Custom",null,null,""]
[708,null,"Custom",null,null,""]
[709,null,"Custom",null,null,""]
[710,null,"Custom",null,null,""]
[711,null,"Custom",null,null,""]
[712,null,"Custom",null,null,""]
[713,null,"Custom",null,null,""]
[714,null,"Custom",null,null,""]
[715,null,"Custom",null,null,""]
[716,null,"Custom",null,null,""]
[717,null,"Custom",null,null,""]
[718,null,"Custom",null,null,""]
[719,null,"Custom",null,null,""]
[720,null,"Custom",null,null,""]
[721,null,"Custom",null,null,""]
[722,null,"Custom",null,null,""]
[723,null,"Custom",null,null,""]
[724,null,"Custom",null,null,""]
[725,null,"Custom",null,null,""]
[726,null,"Custom",null,null,""]
[727,null,"Custom",null,null,""]
[728,null,"Custom",null,null,""]
[729,null,"Custom",null,null,""]
[730,null,"Custom",null,null,""]
[731,null,"Custom",null,null,""]
[732,null,"Custom",null,null,""]
[733,null,"Custom",null,null,""]
[734,null,"Custom",null,null,""]
[735,null,"Custom",null,null,""]
[736,null,"Custom",null,null,""]
[737,null,"Custom",null,null,""]
[738,null,"Custom",null,null,""]
[739,null,"Custom",null,null,""]
[740,null,"Custom",null,null,""]
[741,null,"Custom",null,null,""]
[742,null,"Custom",null,null,{"$f":"IF(AND(B747<>\"\",B746=\"\"),\"Don't skip lines\",IF(AND(D746=\"\",B746<>\"\"),\"Enter U-value\",IF(AND(D746<>\"\",B746=\"\"),\"Enter Description\",\"\")))","v":""}]
[743,null,"Custom",null,null,""]
[744,null,"Custom",null,null,""]
[745,null,"Custom",null,null,""]
[746,null,"Custom",null,null,""]
[747,null,"Custom",null,null,""]
[748,null,"Custom",null,null,""]
[749,null,"Custom",null,null,""]
[750,null,"Custom",null,null,""]
[751,null,"Custom",null,null,""]
[752,null,"Custom",null,null,""]
[753,null,"Custom",null,null,""]
[754,null,"Custom",null,null,""]
[755,null,"Custom",null,null,""]
[756,null,"Custom",null,null,""]
[757,null,"Custom",null,null,""]
[758,null,"Custom",null,null,""]
[759,null,"Custom",null,null,""]
[760,null,"Custom",null,null,""]
[761,null,"Custom",null,null,""]
[762,null,"Custom",null,null,""]
[763,null,"Custom",null,null,""]
[764,null,"Custom",null,null,""]
[765,null,"Custom",null,null,""]
[766,null,"Custom",null,null,""]
[{"$f":"A770+1","v":767},null,"Custom",null,null,""]
[768,null,"Custom",null,null,""]
[769,null,"Custom",null,null,""]
[770,null,"Custom",null,null,""]
[771,null,"Custom",null,null,""]
[772,null,"Custom",null,null,""]
[773,null,"Custom",null,null,""]
[774,null,"Custom",null,null,""]
[775,null,"Custom",null,null,""]
[776,null,"Custom",null,null,""]
[777,null,"Custom",null,null,""]
[778,null,"Custom",null,null,""]
[779,null,"Custom",null,null,""]
[780,null,"Custom",null,null,""]
[781,null,"Custom",null,null,""]
[782,null,"Custom",null,null,""]
[783,null,"Custom",null,null,""]
[784,null,"Custom",null,null,""]
[785,null,"Custom",null,null,""]
[786,null,"Custom",null,null,""]
[787,null,"Custom",null,null,""]
[788,null,"Custom",null,null,""]
[789,null,"Custom",null,null,""]
[790,null,"Custom",null,null,""]
[791,null,"Custom",null,null,""]
[792,null,"Custom",null,null,""]
[793,null,"Custom",null,null,""]
[794,null,"Custom",null,null,""]
[795,null,"Custom",null,null,""]
[796,null,"Custom",null,null,""]
[797,null,"Custom",null,null,""]
[798,null,"Custom",null,null,""]
[799,null,"Custom",null,null,""]
[800,null,"Custom",null,null,""]
[801,null,"Custom",null,null,""]
[802,null,"Custom",null,null,""]
[803,null,"Custom",null,null,""]
[804,null,"Custom",null,null,""]
[805,null,"Custom",null,null,""]
[806,null,"Custom",null,null,{"$f":"IF(AND(B811<>\"\",B810=\"\"),\"Don't skip lines\",IF(AND(D810=\"\",B810<>\"\"),\"Enter U-value\",IF(AND(D810<>\"\",B810=\"\"),\"Enter Description\",\"\")))","v":""}]
[807,null,"Custom",null,null,""]
[808,null,"Custom",null,null,""]
[809,null,"Custom",null,null,""]
[810,null,"Custom",null,null,""]
[811,null,"Custom",null,null,""]
[812,null,"Custom",null,null,""]
[813,null,"Custom",null,null,""]
[814,null,"Custom",null,null,""]
[815,null,"Custom",null,null,""]
[816,null,"Custom",null,null,""]
[817,null,"Custom",null,null,""]
[818,null,"Custom",null,null,""]
[819,null,"Custom",null,null,""]
[820,null,"Custom",null,null,""]
[821,null,"Custom",null,null,""]
[822,null,"Custom",null,null,""]
[823,null,"Custom",null,null,""]
[824,null,"Custom",null,null,""]
[825,null,"Custom",null,null,""]
[826,null,"Custom",null,null,""]
[827,null,"Custom",null,null,""]
[828,null,"Custom",null,null,""]
[829,null,"Custom",null,null,""]
[830,null,"Custom",null,null,""]
[{"$f":"A834+1","v":831},null,"Custom",null,null,""]
[832,null,"Custom",null,null,""]
[833,null,"Custom",null,null,""]
[834,null,"Custom",null,null,""]
[835,null,"Custom",null,null,""]
[836,null,"Custom",null,null,""]
[837,null,"Custom",null,null,""]
[838,null,"Custom",null,null,""]
[839,null,"Custom",null,null,""]
[840,null,"Custom",null,null,""]
[841,null,"Custom",null,null,""]
[842,null,"Custom",null,null,""]
[843,null,"Custom",null,null,""]
[844,null,"Custom",null,null,""]
[845,null,"Custom",null,null,""]
[846,null,"Custom",null,null,""]
[847,null,"Custom",null,null,""]
[848,null,"Custom",null,null,""]
[849,null,"Custom",null,null,""]
[850,null,"Custom",null,null,""]
[851,null,"Custom",null,null,""]
[852,null,"Custom",null,null,""]
[853,null,"Custom",null,null,""]
[854,null,"Custom",null,null,""]
[855,null,"Custom",null,null,""]
[856,null,"Custom",null,null,""]
[857,null,"Custom",null,null,""]
[858,null,"Custom",null,null,""]
[859,null,"Custom",null,null,""]
[860,null,"Custom",null,null,""]
[861,null,"Custom",null,null,""]
[862,null,"Custom",null,null,""]
[863,null,"Custom",null,null,""]
[864,null,"Custom",null,null,""]
[865,null,"Custom",null,null,""]
[866,null,"Custom",null,null,""]
[867,null,"Custom",null,null,""]
[868,null,"Custom",null,null,""]
[869,null,"Custom",null,null,""]
[870,null,"Custom",null,null,{"$f":"IF(AND(B875<>\"\",B874=\"\"),\"Don't skip lines\",IF(AND(D874=\"\",B874<>\"\"),\"Enter U-value\",IF(AND(D874<>\"\",B874=\"\"),\"Enter Description\",\"\")))","v":""}]
[871,null,"Custom",null,null,""]
[872,null,"Custom",null,null,""]
[873,null,"Custom",null,null,""]
[874,null,"Custom",null,null,""]
[875,null,"Custom",null,null,""]
[876,null,"Custom",null,null,""]
[877,null,"Custom",null,null,""]
[878,null,"Custom",null,null,""]
[879,null,"Custom",null,null,""]
[880,null,"Custom",null,null,""]
[881,null,"Custom",null,null,""]
[882,null,"Custom",null,null,""]
[883,null,"Custom",null,null,""]
[884,null,"Custom",null,null,""]
[885,null,"Custom",null,null,""]
[886,null,"Custom",null,null,""]
[887,null,"Custom",null,null,""]
[888,null,"Custom",null,null,""]
[889,null,"Custom",null,null,""]
[890,null,"Custom",null,null,""]
[891,null,"Custom",null,null,""]
[892,null,"Custom",null,null,""]
[893,null,"Custom",null,null,""]
[894,null,"Custom",null,null,""]
[{"$f":"A898+1","v":895},null,"Custom",null,null,""]
[896,null,"Custom",null,null,""]
[897,null,"Custom",null,null,""]
[898,null,"Custom",null,null,""]
[899,null,"Custom",null,null,""]
[900,null,"Custom",null,null,""]
[901,null,"Custom",null,null,""]
[902,null,"Custom",null,null,""]
[903,null,"Custom",null,null,""]
[904,null,"Custom",null,null,""]
[905,null,"Custom",null,null,""]
[906,null,"Custom",null,null,""]
[907,null,"Custom",null,null,""]
[908,null,"Custom",null,null,""]
[909,null,"Custom",null,null,""]
[910,null,"Custom",null,null,""]
[911,null,"Custom",null,null,""]
[912,null,"Custom",null,null,""]
[913,null,"Custom",null,null,""]
[914,null,"Custom",null,null,""]
[915,null,"Custom",null,null,""]
[916,null,"Custom",null,null,""]
[917,null,"Custom",null,null,""]
[918,null,"Custom",null,null,""]
[919,null,"Custom",null,null,""]
[920,null,"Custom",null,null,""]
[921,null,"Custom",null,null,""]
[922,null,"Custom",null,null,""]
[923,null,"Custom",null,null,""]
[924,null,"Custom",null,null,""]
[925,null,"Custom",null,null,""]
[926,null,"Custom",null,null,""]
[927,null,"Custom",null,null,""]
[928,null,"Custom",null,null,""]
[929,null,"Custom",null,null,""]
[930,null,"Custom",null,null,""]
[931,null,"Custom",null,null,""]
[932,null,"Custom",null,null,""]
[933,null,"Custom",null,null,""]
[934,null,"Custom",null,null,{"$f":"IF(AND(B939<>\"\",B938=\"\"),\"Don't skip lines\",IF(AND(D938=\"\",B938<>\"\"),\"Enter U-value\",IF(AND(D938<>\"\",B938=\"\"),\"Enter Description\",\"\")))","v":""}]
[935,null,"Custom",null,null,""]
[936,null,"Custom",null,null,""]
[937,null,"Custom",null,null,""]
[938,null,"Custom",null,null,""]
[939,null,"Custom",null,null,""]
[940,null,"Custom",null,null,""]
[941,null,"Custom",null,null,""]
[942,null,"Custom",null,null,""]
[943,null,"Custom",null,null,""]
[944,null,"Custom",null,null,""]
[945,null,"Custom",null,null,""]
[946,null,"Custom",null,null,""]
[947,null,"Custom",null,null,""]
[948,null,"Custom",null,null,""]
[949,null,"Custom",null,null,""]
[950,null,"Custom",null,null,""]
[951,null,"Custom",null,null,""]
[952,null,"Custom",null,null,""]
[953,null,"Custom",null,null,""]
[954,null,"Custom",null,null,""]
[955,null,"Custom",null,null,""]
[956,null,"Custom",null,null,""]
[957,null,"Custom",null,null,""]
[958,null,"Custom",null,null,""]
[{"$f":"A962+1","v":959},null,"Custom",null,null,""]
[960,null,"Custom",null,null,""]
[961,null,"Custom",null,null,""]
[962,null,"Custom",null,null,""]
[963,null,"Custom",null,null,""]
[964,null,"Custom",null,null,""]
[965,null,"Custom",null,null,""]
[966,null,"Custom",null,null,""]
[967,null,"Custom",null,null,""]
[968,null,"Custom",null,null,""]
[969,null,"Custom",null,null,""]
[970,null,"Custom",null,null,""]
[971,null,"Custom",null,null,""]
[972,null,"Custom",null,null,""]
[973,null,"Custom",null,null,""]
[974,null,"Custom",null,null,""]
[975,null,"Custom",null,null,""]
[976,null,"Custom",null,null,""]
[977,null,"Custom",null,null,""]
[978,null,"Custom",null,null,""]
[979,null,"Custom",null,null,""]
[980,null,"Custom",null,null,""]
[981,null,"Custom",null,null,""]
[982,null,"Custom",null,null,""]
[983,null,"Custom",null,null,""]
[984,null,"Custom",null,null,""]
[985,null,"Custom",null,null,""]
[986,null,"Custom",null,null,""]
[987,null,"Custom",null,null,""]
[988,null,"Custom",null,null,""]
[989,null,"Custom",null,null,""]
[990,null,"Custom",null,null,""]
[991,null,"Custom",null,null,""]
[992,null,"Custom",null,null,""]
[993,null,"Custom",null,null,""]
[994,null,"Custom",null,null,""]
[995,null,"Custom",null,null,""]
[996,null,"Custom",null,null,""]
[997,null,"Custom",null,null,""]
[998,null,"Custom",null,null,{"$f":"IF(AND(B1003<>\"\",B1002=\"\"),\"Don't skip lines\",IF(AND(D1002=\"\",B1002<>\"\"),\"Enter U-value\",IF(AND(D1002<>\"\",B1002=\"\"),\"Enter Description\",\"\")))","v":""}]
[999,null,"Custom",null,null,""]
[1000,null,"Custom",null,null,""]
[1001,null,"Custom",null,null,""]
[1002,null,"Custom",null,null,""]
[1003,null,"Custom",null,null,""]
[1004,null,"Custom",null,null,""]
[1005,null,"Custom",null,null,""]
[1006,null,"Custom",null,null,""]
[1007,null,"Custom",null,null,""]
[1008,null,"Custom",null,null,""]
[1009,null,"Custom",null,null,""]
[1010,null,"Custom",null,null,""]
[1011,null,"Custom",null,null,""]
[1012,null,"Custom",null,null,""]
[1013,null,"Custom",null,null,""]
[1014,null,"Custom",null,null,""]
[1015,null,"Custom",null,null,""]
[1016,null,"Custom",null,null,""]
[1017,null,"Custom",null,null,""]
[1018,null,"Custom",null,null,""]
[1019,null,"Custom",null,null,""]
[1020,null,"Custom",null,null,""]
[1021,null,"Custom",null,null,""]
[1022,null,"Custom",null,null,""]
[{"$f":"A1026+1","v":1023},null,"Custom",null,null,""]
[1024,null,"Custom",null,null,""]
[1025,null,"Custom",null,null,""]
[1026,null,"Custom",null,null,""]
[1027,null,"Custom",null,null,""]
[1028,null,"Custom",null,null,""]
[1029,null,"Custom",null,null,""]
[1030,null,"Custom",null,null,""]
[1031,null,"Custom",null,null,""]
[1032,null,"Custom",null,null,""]
[1033,null,"Custom",null,null,""]
[1034,null,"Custom",null,null,""]
[1035,null,"Custom",null,null,""]
[1036,null,"Custom",null,null,""]
[1037,null,"Custom",null,null,""]
[1038,null,"Custom",null,null,""]
[1039,null,"Custom",null,null,""]
[1040,null,"Custom",null,null,""]
[1041,null,"Custom",null,null,""]
[1042,null,"Custom",null,null,""]
[1043,null,"Custom",null,null,""]
[1044,null,"Custom",null,null,""]
[1045,null,"Custom",null,null,""]
[1046,null,"Custom",null,null,""]
[1047,null,"Custom",null,null,""]
[1048,null,"Custom",null,null,""]
[1049,null,"Custom",null,null,""]
[1050,null,"Custom",null,null,""]
[1051,null,"Custom",null,null,""]
[1052,null,"Custom",null,null,""]
[1053,null,"Custom",null,null,""]
[1054,null,"Custom",null,null,""]
[1055,null,"Custom",null,null,""]
[1056,null,"Custom",null,null,""]
[1057,null,"Custom",null,null,""]
[1058,null,"Custom",null,null,""]
[1059,null,"Custom",null,null,""]
[1060,null,"Custom",null,null,""]
[1061,null,"Custom",null,null,""]
[1062,null,"Custom",null,null,{"$f":"IF(AND(B1067<>\"\",B1066=\"\"),\"Don't skip lines\",IF(AND(D1066=\"\",B1066<>\"\"),\"Enter U-value\",IF(AND(D1066<>\"\",B1066=\"\"),\"Enter Description\",\"\")))","v":""}]
[1063,null,"Custom",null,null,""]
[1064,null,"Custom",null,null,""]
[1065,null,"Custom",null,null,""]
[1066,null,"Custom",null,null,""]
[1067,null,"Custom",null,null,""]
[1068,null,"Custom",null,null,""]
[1069,null,"Custom",null,null,""]
[1070,null,"Custom",null,null,""]
[1071,null,"Custom",null,null,""]
[1072,null,"Custom",null,null,""]
[1073,null,"Custom",null,null,""]
[1074,null,"Custom",null,null,""]
[1075,null,"Custom",null,null,""]
[1076,null,"Custom",null,null,""]
[1077,null,"Custom",null,null,""]
[1078,null,"Custom",null,null,""]
[1079,null,"Custom",null,null,""]
[1080,null,"Custom",null,null,""]
[1081,null,"Custom",null,null,""]
[1082,null,"Custom",null,null,""]
[1083,null,"Custom",null,null,""]
[1084,null,"Custom",null,null,""]
[1085,null,"Custom",null,null,""]
[1086,null,"Custom",null,null,""]
[{"$f":"A1090+1","v":1087},null,"Custom",null,null,""]
[1088,null,"Custom",null,null,""]
[1089,null,"Custom",null,null,""]
[1090,null,"Custom",null,null,""]
[1091,null,"Custom",null,null,""]
[1092,null,"Custom",null,null,""]
[1093,null,"Custom",null,null,""]
[1094,null,"Custom",null,null,""]
[1095,null,"Custom",null,null,""]
[1096,null,"Custom",null,null,""]
[1097,null,"Custom",null,null,""]
[1098,null,"Custom",null,null,""]
[1099,null,"Custom",null,null,""]
[1100,null,"Custom",null,null,""]
[1101,null,"Custom",null,null,""]
[1102,null,"Custom",null,null,""]
[1103,null,"Custom",null,null,""]
[1104,null,"Custom",null,null,""]
[1105,null,"Custom",null,null,""]
[1106,null,"Custom",null,null,""]
[1107,null,"Custom",null,null,""]
[1108,null,"Custom",null,null,""]
[1109,null,"Custom",null,null,""]
[1110,null,"Custom",null,null,""]
[1111,null,"Custom",null,null,""]
[1112,null,"Custom",null,null,""]
[1113,null,"Custom",null,null,""]
[1114,null,"Custom",null,null,""]
[1115,null,"Custom",null,null,""]
[1116,null,"Custom",null,null,""]
[1117,null,"Custom",null,null,""]
[1118,null,"Custom",null,null,""]
[1119,null,"Custom",null,null,""]
[1120,null,"Custom",null,null,""]
[1121,null,"Custom",null,null,""]
[1122,null,"Custom",null,null,""]
[1123,null,"Custom",null,null,""]
[1124,null,"Custom",null,null,""]
[1125,null,"Custom",null,null,""]
[1126,null,"Custom",null,null,{"$f":"IF(AND(B1131<>\"\",B1130=\"\"),\"Don't skip lines\",IF(AND(D1130=\"\",B1130<>\"\"),\"Enter U-value\",IF(AND(D1130<>\"\",B1130=\"\"),\"Enter Description\",\"\")))","v":""}]
[1127,null,"Custom",null,null,""]
[1128,null,"Custom",null,null,""]
[1129,null,"Custom",null,null,""]
[1130,null,"Custom",null,null,""]
[1131,null,"Custom",null,null,""]
[1132,null,"Custom",null,null,""]
[1133,null,"Custom",null,null,""]
[1134,null,"Custom",null,null,""]
[1135,null,"Custom",null,null,""]
[1136,null,"Custom",null,null,""]
[1137,null,"Custom",null,null,""]
[1138,null,"Custom",null,null,""]
[1139,null,"Custom",null,null,""]
[1140,null,"Custom",null,null,""]
[1141,null,"Custom",null,null,""]
[1142,null,"Custom",null,null,""]
[1143,null,"Custom",null,null,""]
[1144,null,"Custom",null,null,""]
[1145,null,"Custom",null,null,""]
[1146,null,"Custom",null,null,""]
[1147,null,"Custom",null,null,""]
[1148,null,"Custom",null,null,""]
[1149,null,"Custom",null,null,""]
[1150,null,"Custom",null,null,""]
[{"$f":"A1154+1","v":1151},null,"Custom",null,null,""]
[1152,null,"Custom",null,null,""]
[1153,null,"Custom",null,null,""]
[1154,null,"Custom",null,null,""]
[1155,null,"Custom",null,null,""]
[1156,null,"Custom",null,null,""]
[1157,null,"Custom",null,null,""]
[1158,null,"Custom",null,null,""]
[1159,null,"Custom",null,null,""]
[1160,null,"Custom",null,null,""]
[1161,null,"Custom",null,null,""]
[1162,null,"Custom",null,null,""]
[1163,null,"Custom",null,null,""]
[1164,null,"Custom",null,null,""]
[1165,null,"Custom",null,null,""]
[1166,null,"Custom",null,null,""]
[1167,null,"Custom",null,null,""]
[1168,null,"Custom",null,null,""]
[1169,null,"Custom",null,null,""]
[1170,null,"Custom",null,null,""]
[1171,null,"Custom",null,null,""]
[1172,null,"Custom",null,null,""]
[1173,null,"Custom",null,null,""]
[1174,null,"Custom",null,null,""]
[1175,null,"Custom",null,null,""]
[1176,null,"Custom",null,null,""]
[1177,null,"Custom",null,null,""]
[1178,null,"Custom",null,null,""]
[1179,null,"Custom",null,null,""]
[1180,null,"Custom",null,null,""]
[1181,null,"Custom",null,null,""]
[1182,null,"Custom",null,null,""]
[1183,null,"Custom",null,null,""]
[1184,null,"Custom",null,null,""]
[1185,null,"Custom",null,null,""]
[1186,null,"Custom",null,null,""]
[1187,null,"Custom",null,null,""]
[1188,null,"Custom",null,null,""]
[1189,null,"Custom",null,null,""]
[1190,null,"Custom",null,null,{"$f":"IF(AND(B1195<>\"\",B1194=\"\"),\"Don't skip lines\",IF(AND(D1194=\"\",B1194<>\"\"),\"Enter U-value\",IF(AND(D1194<>\"\",B1194=\"\"),\"Enter Description\",\"\")))","v":""}]
[1191,null,"Custom",null,null,""]
[1192,null,"Custom",null,null,""]
[1193,null,"Custom",null,null,""]
[1194,null,"Custom",null,null,""]
[1195,null,"Custom",null,null,""]
[1196,null,"Custom",null,null,""]
[1197,null,"Custom",null,null,""]
[1198,null,"Custom",null,null,""]
[1199,null,"Custom",null,null,""]
[1200,null,"Custom",null,null,""]
[1201,null,"Custom",null,null,""]
[1202,null,"Custom",null,null,""]
[1203,null,"Custom",null,null,""]
[1204,null,"Custom",null,null,""]
[1205,null,"Custom",null,null,""]
[1206,null,"Custom",null,null,""]
[1207,null,"Custom",null,null,""]
[1208,null,"Custom",null,null,""]
[1209,null,"Custom",null,null,""]
[1210,null,"Custom",null,null,""]
[1211,null,"Custom",null,null,""]
[1212,null,"Custom",null,null,""]
[1213,null,"Custom",null,null,""]
[1214,null,"Custom",null,null,""]
[{"$f":"A1218+1","v":1215},null,"Custom",null,null,""]
[1216,null,"Custom",null,null,""]
[1217,null,"Custom",null,null,""]
[1218,null,"Custom",null,null,""]
[1219,null,"Custom",null,null,""]
[1220,null,"Custom",null,null,""]
[1221,null,"Custom",null,null,""]
[1222,null,"Custom",null,null,""]
[1223,null,"Custom",null,null,""]
[1224,null,"Custom",null,null,""]
[1225,null,"Custom",null,null,""]
[1226,null,"Custom",null,null,""]
[1227,null,"Custom",null,null,""]
[1228,null,"Custom",null,null,""]
[1229,null,"Custom",null,null,""]
[1230,null,"Custom",null,null,""]
[1231,null,"Custom",null,null,""]
[1232,null,"Custom",null,null,""]
[1233,null,"Custom",null,null,""]
[1234,null,"Custom",null,null,""]
[1235,null,"Custom",null,null,""]
[1236,null,"Custom",null,null,""]
[1237,null,"Custom",null,null,""]
[1238,null,"Custom",null,null,""]
[1239,null,"Custom",null,null,""]
[1240,null,"Custom",null,null,""]
[1241,null,"Custom",null,null,""]
[1242,null,"Custom",null,null,""]
[1243,null,"Custom",null,null,""]
[1244,null,"Custom",null,null,""]
[1245,null,"Custom",null,null,""]
[1246,null,"Custom",null,null,""]
[1247,null,"Custom",null,null,""]
[1248,null,"Custom",null,null,""]
[1249,null,"Custom",null,null,""]
[1250,null,"Custom",null,null,""]
[1251,null,"Custom",null,null,""]
[1252,null,"Custom",null,null,""]
[1253,null,"Custom",null,null,""]
[1254,null,"Custom",null,null,{"$f":"IF(AND(B1259<>\"\",B1258=\"\"),\"Don't skip lines\",IF(AND(D1258=\"\",B1258<>\"\"),\"Enter U-value\",IF(AND(D1258<>\"\",B1258=\"\"),\"Enter Description\",\"\")))","v":""}]
[1255,null,"Custom",null,null,""]
[1256,null,"Custom",null,null,""]
[1257,null,"Custom",null,null,""]
[1258,null,"Custom",null,null,""]
[1259,null,"Custom",null,null,""]
[1260,null,"Custom",null,null,""]
[1261,null,"Custom",null,null,""]
[1262,null,"Custom",null,null,""]
[1263,null,"Custom",null,null,""]
[1264,null,"Custom",null,null,""]
[1265,null,"Custom",null,null,""]
[1266,null,"Custom",null,null,""]
[1267,null,"Custom",null,null,""]
[1268,null,"Custom",null,null,""]
[1269,null,"Custom",null,null,""]
[1270,null,"Custom",null,null,""]
[1271,null,"Custom",null,null,""]
[1272,null,"Custom",null,null,""]
[1273,null,"Custom",null,null,""]
[1274,null,"Custom",null,null,""]
[1275,null,"Custom",null,null,""]
[1276,null,"Custom",null,null,""]
[1277,null,"Custom",null,null,""]
[1278,null,"Custom",null,null,""]
[{"$f":"A1282+1","v":1279},null,"Custom",null,null,""]
[1280,null,"Custom",null,null,""]
[1281,null,"Custom",null,null,""]
[1282,null,"Custom",null,null,""]
[1283,null,"Custom",null,null,""]
[1284,null,"Custom",null,null,""]
[1285,null,"Custom",null,null,""]
[1286,null,"Custom",null,null,""]
[1287,null,"Custom",null,null,""]
[1288,null,"Custom",null,null,""]
[1289,null,"Custom",null,null,""]
[1290,null,"Custom",null,null,""]
[1291,null,"Custom",null,null,""]
[1292,null,"Custom",null,null,""]
[1293,null,"Custom",null,null,""]
[1294,null,"Custom",null,null,""]
[1295,null,"Custom",null,null,""]
[1296,null,"Custom",null,null,""]
[1297,null,"Custom",null,null,""]
[1298,null,"Custom",null,null,""]
[1299,null,"Custom",null,null,""]
[1300,null,"Custom",null,null,""]
[1301,null,"Custom",null,null,""]
[1302,null,"Custom",null,null,""]
[1303,null,"Custom",null,null,""]
[1304,null,"Custom",null,null,""]
[1305,null,"Custom",null,null,""]
[1306,null,"Custom",null,null,""]
[1307,null,"Custom",null,null,""]
[1308,null,"Custom",null,null,""]
[1309,null,"Custom",null,null,""]
[1310,null,"Custom",null,null,""]
[1311,null,"Custom",null,null,""]
[1312,null,"Custom",null,null,""]
[1313,null,"Custom",null,null,""]
[1314,null,"Custom",null,null,""]
[1315,null,"Custom",null,null,""]
[1316,null,"Custom",null,null,""]
[1317,null,"Custom",null,null,""]
[1318,null,"Custom",null,null,{"$f":"IF(AND(B1323<>\"\",B1322=\"\"),\"Don't skip lines\",IF(AND(D1322=\"\",B1322<>\"\"),\"Enter U-value\",IF(AND(D1322<>\"\",B1322=\"\"),\"Enter Description\",\"\")))","v":""}]
[1319,null,"Custom",null,null,""]
[1320,null,"Custom",null,null,""]
[1321,null,"Custom",null,null,""]
[1322,null,"Custom",null,null,""]
[1323,null,"Custom",null,null,""]
[1324,null,"Custom",null,null,""]
[1325,null,"Custom",null,null,""]
[1326,null,"Custom",null,null,""]
[1327,null,"Custom",null,null,""]
[1328,null,"Custom",null,null,""]
[1329,null,"Custom",null,null,""]
[1330,null,"Custom",null,null,""]
[1331,null,"Custom",null,null,""]
[1332,null,"Custom",null,null,""]
[1333,null,"Custom",null,null,""]
[1334,null,"Custom",null,null,""]
[1335,null,"Custom",null,null,""]
[1336,null,"Custom",null,null,""]
[1337,null,"Custom",null,null,""]
[1338,null,"Custom",null,null,""]
[1339,null,"Custom",null,null,""]
[1340,null,"Custom",null,null,""]
[1341,null,"Custom",null,null,""]
[1342,null,"Custom",null,null,""]
[{"$f":"A1346+1","v":1343},null,"Custom",null,null,""]
[1344,null,"Custom",null,null,""]
[1345,null,"Custom",null,null,""]
[1346,null,"Custom",null,null,""]
[1347,null,"Custom",null,null,""]
[1348,null,"Custom",null,null,""]
[1349,null,"Custom",null,null,""]
[1350,null,"Custom",null,null,""]
[1351,null,"Custom",null,null,""]
[1352,null,"Custom",null,null,""]
[1353,null,"Custom",null,null,""]
[1354,null,"Custom",null,null,""]
[1355,null,"Custom",null,null,""]
[1356,null,"Custom",null,null,""]
[1357,null,"Custom",null,null,""]
[1358,null,"Custom",null,null,""]
[1359,null,"Custom",null,null,""]
[1360,null,"Custom",null,null,""]
[1361,null,"Custom",null,null,""]
[1362,null,"Custom",null,null,""]
[1363,null,"Custom",null,null,""]
[1364,null,"Custom",null,null,""]
[1365,null,"Custom",null,null,""]
[1366,null,"Custom",null,null,""]
[1367,null,"Custom",null,null,""]
[1368,null,"Custom",null,null,""]
[1369,null,"Custom",null,null,""]
[1370,null,"Custom",null,null,""]
[1371,null,"Custom",null,null,""]
[1372,null,"Custom",null,null,""]
[1373,null,"Custom",null,null,""]
[1374,null,"Custom",null,null,""]
[1375,null,"Custom",null,null,""]
[1376,null,"Custom",null,null,""]
[1377,null,"Custom",null,null,""]
[1378,null,"Custom",null,null,""]
[1379,null,"Custom",null,null,""]
[1380,null,"Custom",null,null,""]
[1381,null,"Custom",null,null,""]
[1382,null,"Custom",null,null,{"$f":"IF(AND(B1387<>\"\",B1386=\"\"),\"Don't skip lines\",IF(AND(D1386=\"\",B1386<>\"\"),\"Enter U-value\",IF(AND(D1386<>\"\",B1386=\"\"),\"Enter Description\",\"\")))","v":""}]
[1383,null,"Custom",null,null,""]
[1384,null,"Custom",null,null,""]
[1385,null,"Custom",null,null,""]
[1386,null,"Custom",null,null,""]
[1387,null,"Custom",null,null,""]
[1388,null,"Custom",null,null,""]
[1389,null,"Custom",null,null,""]
[1390,null,"Custom",null,null,""]
[1391,null,"Custom",null,null,""]
[1392,null,"Custom",null,null,""]
[1393,null,"Custom",null,null,""]
[1394,null,"Custom",null,null,""]
[1395,null,"Custom",null,null,""]
[1396,null,"Custom",null,null,""]
[1397,null,"Custom",null,null,""]
[1398,null,"Custom",null,null,""]
[1399,null,"Custom",null,null,""]
[1400,null,"Custom",null,null,""]
[1401,null,"Custom",null,null,""]
[1402,null,"Custom",null,null,""]
[1403,null,"Custom",null,null,""]
[1404,null,"Custom",null,null,""]
[1405,null,"Custom",null,null,""]
[1406,null,"Custom",null,null,""]
[{"$f":"A1410+1","v":1407},null,"Custom",null,null,""]
[1408,null,"Custom",null,null,""]
[1409,null,"Custom",null,null,""]
[1410,null,"Custom",null,null,""]
[1411,null,"Custom",null,null,""]
[1412,null,"Custom",null,null,""]
[1413,null,"Custom",null,null,""]
[1414,null,"Custom",null,null,""]
[1415,null,"Custom",null,null,""]
[1416,null,"Custom",null,null,""]
[1417,null,"Custom",null,null,""]
[1418,null,"Custom",null,null,""]
[1419,null,"Custom",null,null,""]
[1420,null,"Custom",null,null,""]
[1421,null,"Custom",null,null,""]
[1422,null,"Custom",null,null,""]
[1423,null,"Custom",null,null,""]
[1424,null,"Custom",null,null,""]
[1425,null,"Custom",null,null,""]
[1426,null,"Custom",null,null,""]
[1427,null,"Custom",null,null,""]
[1428,null,"Custom",null,null,""]
[1429,null,"Custom",null,null,""]
[1430,null,"Custom",null,null,""]
[1431,null,"Custom",null,null,""]
[1432,null,"Custom",null,null,""]
[1433,null,"Custom",null,null,""]
[1434,null,"Custom",null,null,""]
[1435,null,"Custom",null,null,""]
[1436,null,"Custom",null,null,""]
[1437,null,"Custom",null,null,""]
[1438,null,"Custom",null,null,""]
[1439,null,"Custom",null,null,""]
[1440,null,"Custom",null,null,""]
[1441,null,"Custom",null,null,""]
[1442,null,"Custom",null,null,""]
[1443,null,"Custom",null,null,""]
[1444,null,"Custom",null,null,""]
[1445,null,"Custom",null,null,""]
[1446,null,"Custom",null,null,{"$f":"IF(AND(B1451<>\"\",B1450=\"\"),\"Don't skip lines\",IF(AND(D1450=\"\",B1450<>\"\"),\"Enter U-value\",IF(AND(D1450<>\"\",B1450=\"\"),\"Enter Description\",\"\")))","v":""}]
[1447,null,"Custom",null,null,""]
[1448,null,"Custom",null,null,""]
[1449,null,"Custom",null,null,""]
[1450,null,"Custom",null,null,""]
[1451,null,"Custom",null,null,""]
[1452,null,"Custom",null,null,""]
[1453,null,"Custom",null,null,""]
[1454,null,"Custom",null,null,""]
[1455,null,"Custom",null,null,""]
[1456,null,"Custom",null,null,""]
[1457,null,"Custom",null,null,""]
[1458,null,"Custom",null,null,""]
[1459,null,"Custom",null,null,""]
[1460,null,"Custom",null,null,""]
[1461,null,"Custom",null,null,""]
[1462,null,"Custom",null,null,""]
[1463,null,"Custom",null,null,""]
[1464,null,"Custom",null,null,""]
[1465,null,"Custom",null,null,""]
[1466,null,"Custom",null,null,""]
[1467,null,"Custom",null,null,""]
[1468,null,"Custom",null,null,""]
[1469,null,"Custom",null,null,""]
[1470,null,"Custom",null,null,""]
[{"$f":"A1474+1","v":1471},null,"Custom",null,null,""]
[1472,null,"Custom",null,null,""]
[1473,null,"Custom",null,null,""]
[1474,null,"Custom",null,null,""]
[1475,null,"Custom",null,null,""]
[1476,null,"Custom",null,null,""]
[1477,null,"Custom",null,null,""]
[1478,null,"Custom",null,null,""]
[1479,null,"Custom",null,null,""]
[1480,null,"Custom",null,null,""]
[1481,null,"Custom",null,null,""]
[1482,null,"Custom",null,null,""]
[1483,null,"Custom",null,null,""]
[1484,null,"Custom",null,null,""]
[1485,null,"Custom",null,null,""]
[1486,null,"Custom",null,null,""]
[1487,null,"Custom",null,null,""]
[1488,null,"Custom",null,null,""]
[1489,null,"Custom",null,null,""]
[1490,null,"Custom",null,null,""]
[1491,null,"Custom",null,null,""]
[1492,null,"Custom",null,null,""]
[1493,null,"Custom",null,null,""]
[1494,null,"Custom",null,null,""]
[1495,null,"Custom",null,null,""]
[1496,null,"Custom",null,null,""]
[1497,null,"Custom",null,null,""]
[1498,null,"Custom",null,null,""]
[1499,null,"Custom",null,null,""]
[1500,null,"Custom",null,null,""]
[1501,null,"Custom",null,null,""]
[1502,null,"Custom",null,null,""]
[1503,null,"Custom",null,null,""]
[1504,null,"Custom",null,null,""]
[1505,null,"Custom",null,null,""]
[1506,null,"Custom",null,null,""]
[1507,null,"Custom",null,null,""]
[1508,null,"Custom",null,null,""]
[1509,null,"Custom",null,null,""]
[1510,null,"Custom",null,null,{"$f":"IF(AND(B1515<>\"\",B1514=\"\"),\"Don't skip lines\",IF(AND(D1514=\"\",B1514<>\"\"),\"Enter U-value\",IF(AND(D1514<>\"\",B1514=\"\"),\"Enter Description\",\"\")))","v":""}]
[1511,null,"Custom",null,null,""]
[1512,null,"Custom",null,null,""]
[1513,null,"Custom",null,null,""]
[1514,null,"Custom",null,null,""]
[1515,null,"Custom",null,null,""]
[1516,null,"Custom",null,null,""]
[1517,null,"Custom",null,null,""]
[1518,null,"Custom",null,null,""]
[1519,null,"Custom",null,null,""]
[1520,null,"Custom",null,null,""]
[1521,null,"Custom",null,null,""]
[1522,null,"Custom",null,null,""]
[1523,null,"Custom",null,null,""]
[1524,null,"Custom",null,null,""]
[1525,null,"Custom",null,null,""]
[1526,null,"Custom",null,null,""]
[1527,null,"Custom",null,null,""]
[1528,null,"Custom",null,null,""]
[1529,null,"Custom",null,null,""]
[1530,null,"Custom",null,null,""]
[1531,null,"Custom",null,null,""]
[1532,null,"Custom",null,null,""]
[1533,null,"Custom",null,null,""]
[1534,null,"Custom",null,null,""]
[{"$f":"A1538+1","v":1535},null,"Custom",null,null,""]
[1536,null,"Custom",null,null,""]
[1537,null,"Custom",null,null,""]
[1538,null,"Custom",null,null,""]
[1539,null,"Custom",null,null,""]
[1540,null,"Custom",null,null,""]
[1541,null,"Custom",null,null,""]
[1542,null,"Custom",null,null,""]
[1543,null,"Custom",null,null,""]
[1544,null,"Custom",null,null,""]
[1545,null,"Custom",null,null,""]
[1546,null,"Custom",null,null,""]
[1547,null,"Custom",null,null,""]
[1548,null,"Custom",null,null,""]
[1549,null,"Custom",null,null,""]
[1550,null,"Custom",null,null,""]
[1551,null,"Custom",null,null,""]
[1552,null,"Custom",null,null,""]
[1553,null,"Custom",null,null,""]
[1554,null,"Custom",null,null,""]
[1555,null,"Custom",null,null,""]
[1556,null,"Custom",null,null,""]
[1557,null,"Custom",null,null,""]
[1558,null,"Custom",null,null,""]
[1559,null,"Custom",null,null,""]
[1560,null,"Custom",null,null,""]
[1561,null,"Custom",null,null,""]
[1562,null,"Custom",null,null,""]
[1563,null,"Custom",null,null,""]
[1564,null,"Custom",null,null,""]
[1565,null,"Custom",null,null,""]
[1566,null,"Custom",null,null,""]
[1567,null,"Custom",null,null,""]
[1568,null,"Custom",null,null,""]
[1569,null,"Custom",null,null,""]
[1570,null,"Custom",null,null,""]
[1571,null,"Custom",null,null,""]
[1572,null,"Custom",null,null,""]
[1573,null,"Custom",null,null,""]
[1574,null,"Custom",null,null,{"$f":"IF(AND(B1579<>\"\",B1578=\"\"),\"Don't skip lines\",IF(AND(D1578=\"\",B1578<>\"\"),\"Enter U-value\",IF(AND(D1578<>\"\",B1578=\"\"),\"Enter Description\",\"\")))","v":""}]
[1575,null,"Custom",null,null,""]
[1576,null,"Custom",null,null,""]
[1577,null,"Custom",null,null,""]
[1578,null,"Custom",null,null,""]
[1579,null,"Custom",null,null,""]
[1580,null,"Custom",null,null,""]
[1581,null,"Custom",null,null,""]
[1582,null,"Custom",null,null,""]
[1583,null,"Custom",null,null,""]
[1584,null,"Custom",null,null,""]
[1585,null,"Custom",null,null,""]
[1586,null,"Custom",null,null,""]
[1587,null,"Custom",null,null,""]
[1588,null,"Custom",null,null,""]
[1589,null,"Custom",null,null,""]
[1590,null,"Custom",null,null,""]
[1591,null,"Custom",null,null,""]
[1592,null,"Custom",null,null,""]
[1593,null,"Custom",null,null,""]
[1594,null,"Custom",null,null,""]
[1595,null,"Custom",null,null,""]
[1596,null,"Custom",null,null,""]
[1597,null,"Custom",null,null,""]
[1598,null,"Custom",null,null,""]
[{"$f":"A1602+1","v":1599},null,"Custom",null,null,""]
[1600,null,"Custom",null,null,""]
[1601,null,"Custom",null,null,""]
[1602,null,"Custom",null,null,""]
[1603,null,"Custom",null,null,""]
[1604,null,"Custom",null,null,""]
[1605,null,"Custom",null,null,""]
[1606,null,"Custom",null,null,""]
[1607,null,"Custom",null,null,""]
[1608,null,"Custom",null,null,""]
[1609,null,"Custom",null,null,""]
[1610,null,"Custom",null,null,""]
[1611,null,"Custom",null,null,""]
[1612,null,"Custom",null,null,""]
[1613,null,"Custom",null,null,""]
[1614,null,"Custom",null,null,""]
[1615,null,"Custom",null,null,""]
[1616,null,"Custom",null,null,""]
[1617,null,"Custom",null,null,""]
[1618,null,"Custom",null,null,""]
[1619,null,"Custom",null,null,""]
[1620,null,"Custom",null,null,""]
[1621,null,"Custom",null,null,""]
[1622,null,"Custom",null,null,""]
[1623,null,"Custom",null,null,""]
[1624,null,"Custom",null,null,""]
[1625,null,"Custom",null,null,""]
[1626,null,"Custom",null,null,""]
[1627,null,"Custom",null,null,""]
[1628,null,"Custom",null,null,""]
[1629,null,"Custom",null,null,""]
[1630,null,"Custom",null,null,""]
[1631,null,"Custom",null,null,""]
[1632,null,"Custom",null,null,""]
[1633,null,"Custom",null,null,""]
[1634,null,"Custom",null,null,""]
[1635,null,"Custom",null,null,""]
[1636,null,"Custom",null,null,""]
[1637,null,"Custom",null,null,""]
[1638,null,"Custom",null,null,{"$f":"IF(AND(B1643<>\"\",B1642=\"\"),\"Don't skip lines\",IF(AND(D1642=\"\",B1642<>\"\"),\"Enter U-value\",IF(AND(D1642<>\"\",B1642=\"\"),\"Enter Description\",\"\")))","v":""}]
[1639,null,"Custom",null,null,""]
[1640,null,"Custom",null,null,""]
[1641,null,"Custom",null,null,""]
[1642,null,"Custom",null,null,""]
[1643,null,"Custom",null,null,""]
[1644,null,"Custom",null,null,""]
[1645,null,"Custom",null,null,""]
[1646,null,"Custom",null,null,""]
[1647,null,"Custom",null,null,""]
[1648,null,"Custom",null,null,""]
[1649,null,"Custom",null,null,""]
[1650,null,"Custom",null,null,""]
[1651,null,"Custom",null,null,""]
[1652,null,"Custom",null,null,""]
[1653,null,"Custom",null,null,""]
[1654,null,"Custom",null,null,""]
[1655,null,"Custom",null,null,""]
[1656,null,"Custom",null,null,""]
[1657,null,"Custom",null,null,""]
[1658,null,"Custom",null,null,""]
[1659,null,"Custom",null,null,""]
[1660,null,"Custom",null,null,""]
[1661,null,"Custom",null,null,""]
[1662,null,"Custom",null,null,""]
[{"$f":"A1666+1","v":1663},null,"Custom",null,null,""]
[1664,null,"Custom",null,null,""]
[1665,null,"Custom",null,null,""]
[1666,null,"Custom",null,null,""]
[1667,null,"Custom",null,null,""]
[1668,null,"Custom",null,null,""]
[1669,null,"Custom",null,null,""]
[1670,null,"Custom",null,null,""]
[1671,null,"Custom",null,null,""]
[1672,null,"Custom",null,null,""]
[1673,null,"Custom",null,null,""]
[1674,null,"Custom",null,null,""]
[1675,null,"Custom",null,null,""]
[1676,null,"Custom",null,null,""]
[1677,null,"Custom",null,null,""]
[1678,null,"Custom",null,null,""]
[1679,null,"Custom",null,null,""]
[1680,null,"Custom",null,null,""]
[1681,null,"Custom",null,null,""]
[1682,null,"Custom",null,null,""]
[1683,null,"Custom",null,null,""]
[1684,null,"Custom",null,null,""]
[1685,null,"Custom",null,null,""]
[1686,null,"Custom",null,null,""]
[1687,null,"Custom",null,null,""]
[1688,null,"Custom",null,null,""]
[1689,null,"Custom",null,null,""]
[1690,null,"Custom",null,null,""]
[1691,null,"Custom",null,null,""]
[1692,null,"Custom",null,null,""]
[1693,null,"Custom",null,null,""]
[1694,null,"Custom",null,null,""]
[1695,null,"Custom",null,null,""]
[1696,null,"Custom",null,null,""]
[1697,null,"Custom",null,null,""]
[1698,null,"Custom",null,null,""]
[1699,null,"Custom",null,null,""]
[1700,null,"Custom",null,null,""]
[1701,null,"Custom",null,null,""]
[1702,null,"Custom",null,null,{"$f":"IF(AND(B1707<>\"\",B1706=\"\"),\"Don't skip lines\",IF(AND(D1706=\"\",B1706<>\"\"),\"Enter U-value\",IF(AND(D1706<>\"\",B1706=\"\"),\"Enter Description\",\"\")))","v":""}]
[1703,null,"Custom",null,null,""]
[1704,null,"Custom",null,null,""]
[1705,null,"Custom",null,null,""]
[1706,null,"Custom",null,null,""]
[1707,null,"Custom",null,null,""]
[1708,null,"Custom",null,null,""]
[1709,null,"Custom",null,null,""]
[1710,null,"Custom",null,null,""]
[1711,null,"Custom",null,null,""]
[1712,null,"Custom",null,null,""]
[1713,null,"Custom",null,null,""]
[1714,null,"Custom",null,null,""]
[1715,null,"Custom",null,null,""]
[1716,null,"Custom",null,null,""]
[1717,null,"Custom",null,null,""]
[1718,null,"Custom",null,null,""]
[1719,null,"Custom",null,null,""]
[1720,null,"Custom",null,null,""]
[1721,null,"Custom",null,null,""]
[1722,null,"Custom",null,null,""]
[1723,null,"Custom",null,null,""]
[1724,null,"Custom",null,null,""]
[1725,null,"Custom",null,null,""]
[1726,null,"Custom",null,null,""]
[{"$f":"A1730+1","v":1727},null,"Custom",null,null,""]
[1728,null,"Custom",null,null,""]
[1729,null,"Custom",null,null,""]
[1730,null,"Custom",null,null,""]
[1731,null,"Custom",null,null,""]
[1732,null,"Custom",null,null,""]
[1733,null,"Custom",null,null,""]
[1734,null,"Custom",null,null,""]
[1735,null,"Custom",null,null,""]
[1736,null,"Custom",null,null,""]
[1737,null,"Custom",null,null,""]
[1738,null,"Custom",null,null,""]
[1739,null,"Custom",null,null,""]
[1740,null,"Custom",null,null,""]
[1741,null,"Custom",null,null,""]
[1742,null,"Custom",null,null,""]
[1743,null,"Custom",null,null,""]
[1744,null,"Custom",null,null,""]
[1745,null,"Custom",null,null,""]
[1746,null,"Custom",null,null,""]
[1747,null,"Custom",null,null,""]
[1748,null,"Custom",null,null,""]
[1749,null,"Custom",null,null,""]
[1750,null,"Custom",null,null,""]
[1751,null,"Custom",null,null,""]
[1752,null,"Custom",null,null,""]
[1753,null,"Custom",null,null,""]
[1754,null,"Custom",null,null,""]
[1755,null,"Custom",null,null,""]
[1756,null,"Custom",null,null,""]
[1757,null,"Custom",null,null,""]
[1758,null,"Custom",null,null,""]
[1759,null,"Custom",null,null,""]
[1760,null,"Custom",null,null,""]
[1761,null,"Custom",null,null,""]
[1762,null,"Custom",null,null,""]
[1763,null,"Custom",null,null,""]
[1764,null,"Custom",null,null,""]
[1765,null,"Custom",null,null,""]
[1766,null,"Custom",null,null,{"$f":"IF(AND(B1771<>\"\",B1770=\"\"),\"Don't skip lines\",IF(AND(D1770=\"\",B1770<>\"\"),\"Enter U-value\",IF(AND(D1770<>\"\",B1770=\"\"),\"Enter Description\",\"\")))","v":""}]
[1767,null,"Custom",null,null,""]
[1768,null,"Custom",null,null,""]
[1769,null,"Custom",null,null,""]
[1770,null,"Custom",null,null,""]
[1771,null,"Custom",null,null,""]
[1772,null,"Custom",null,null,""]
[1773,null,"Custom",null,null,""]
[1774,null,"Custom",null,null,""]
[1775,null,"Custom",null,null,""]
[1776,null,"Custom",null,null,""]
[1777,null,"Custom",null,null,""]
[1778,null,"Custom",null,null,""]
[1779,null,"Custom",null,null,""]
[1780,null,"Custom",null,null,""]
[1781,null,"Custom",null,null,""]
[1782,null,"Custom",null,null,""]
[1783,null,"Custom",null,null,""]
[1784,null,"Custom",null,null,""]
[1785,null,"Custom",null,null,""]
[1786,null,"Custom",null,null,""]
[1787,null,"Custom",null,null,""]
[1788,null,"Custom",null,null,""]
[1789,null,"Custom",null,null,""]
[1790,null,"Custom",null,null,""]
[{"$f":"A1794+1","v":1791},null,"Custom",null,null,""]
[1792,null,"Custom",null,null,""]
[1793,null,"Custom",null,null,""]
[1794,null,"Custom",null,null,""]
[1795,null,"Custom",null,null,""]
[1796,null,"Custom",null,null,""]
[1797,null,"Custom",null,null,""]
[1798,null,"Custom",null,null,""]
[1799,null,"Custom",null,null,""]
[1800,null,"Custom",null,null,""]
[1801,null,"Custom",null,null,""]
[1802,null,"Custom",null,null,""]
[1803,null,"Custom",null,null,""]
[1804,null,"Custom",null,null,""]
[1805,null,"Custom",null,null,""]
[1806,null,"Custom",null,null,""]
[1807,null,"Custom",null,null,""]
[1808,null,"Custom",null,null,""]
[1809,null,"Custom",null,null,""]
[1810,null,"Custom",null,null,""]
[1811,null,"Custom",null,null,""]
[1812,null,"Custom",null,null,""]
[1813,null,"Custom",null,null,""]
[1814,null,"Custom",null,null,""]
[1815,null,"Custom",null,null,""]
[1816,null,"Custom",null,null,""]
[1817,null,"Custom",null,null,""]
[1818,null,"Custom",null,null,""]
[1819,null,"Custom",null,null,""]
[1820,null,"Custom",null,null,""]
[1821,null,"Custom",null,null,""]
[1822,null,"Custom",null,null,""]
[1823,null,"Custom",null,null,""]
[1824,null,"Custom",null,null,""]
[1825,null,"Custom",null,null,""]
[1826,null,"Custom",null,null,""]
[1827,null,"Custom",null,null,""]
[1828,null,"Custom",null,null,""]
[1829,null,"Custom",null,null,""]
[1830,null,"Custom",null,null,{"$f":"IF(AND(B1835<>\"\",B1834=\"\"),\"Don't skip lines\",IF(AND(D1834=\"\",B1834<>\"\"),\"Enter U-value\",IF(AND(D1834<>\"\",B1834=\"\"),\"Enter Description\",\"\")))","v":""}]
[1831,null,"Custom",null,null,""]
[1832,null,"Custom",null,null,""]
[1833,null,"Custom",null,null,""]
[1834,null,"Custom",null,null,""]
[1835,null,"Custom",null,null,""]
[1836,null,"Custom",null,null,""]
[1837,null,"Custom",null,null,""]
[1838,null,"Custom",null,null,""]
[1839,null,"Custom",null,null,""]
[1840,null,"Custom",null,null,""]
[1841,null,"Custom",null,null,""]
[1842,null,"Custom",null,null,""]
[1843,null,"Custom",null,null,""]
[1844,null,"Custom",null,null,""]
[1845,null,"Custom",null,null,""]
[1846,null,"Custom",null,null,""]
[1847,null,"Custom",null,null,""]
[1848,null,"Custom",null,null,""]
[1849,null,"Custom",null,null,""]
[1850,null,"Custom",null,null,""]
[1851,null,"Custom",null,null,""]
[1852,null,"Custom",null,null,""]
[1853,null,"Custom",null,null,""]
[1854,null,"Custom",null,null,""]
[{"$f":"A1858+1","v":1855},null,"Custom",null,null,""]
[1856,null,"Custom",null,null,""]
[1857,null,"Custom",null,null,""]
[1858,null,"Custom",null,null,""]
[1859,null,"Custom",null,null,""]
[1860,null,"Custom",null,null,""]
[1861,null,"Custom",null,null,""]
[1862,null,"Custom",null,null,""]
[1863,null,"Custom",null,null,""]
[1864,null,"Custom",null,null,""]
[1865,null,"Custom",null,null,""]
[1866,null,"Custom",null,null,""]
[1867,null,"Custom",null,null,""]
[1868,null,"Custom",null,null,""]
[1869,null,"Custom",null,null,""]
[1870,null,"Custom",null,null,""]
[1871,null,"Custom",null,null,""]
[1872,null,"Custom",null,null,""]
[1873,null,"Custom",null,null,""]
[1874,null,"Custom",null,null,""]
[1875,null,"Custom",null,null,""]
[1876,null,"Custom",null,null,""]
[1877,null,"Custom",null,null,""]
[1878,null,"Custom",null,null,""]
[1879,null,"Custom",null,null,""]
[1880,null,"Custom",null,null,""]
[1881,null,"Custom",null,null,""]
[1882,null,"Custom",null,null,""]
[1883,null,"Custom",null,null,""]
[1884,null,"Custom",null,null,""]
[1885,null,"Custom",null,null,""]
[1886,null,"Custom",null,null,""]
[1887,null,"Custom",null,null,""]
[1888,null,"Custom",null,null,""]
[1889,null,"Custom",null,null,""]
[1890,null,"Custom",null,null,""]
[1891,null,"Custom",null,null,""]
[1892,null,"Custom",null,null,""]
[1893,null,"Custom",null,null,""]
[1894,null,"Custom",null,null,{"$f":"IF(AND(B1899<>\"\",B1898=\"\"),\"Don't skip lines\",IF(AND(D1898=\"\",B1898<>\"\"),\"Enter U-value\",IF(AND(D1898<>\"\",B1898=\"\"),\"Enter Description\",\"\")))","v":""}]
[1895,null,"Custom",null,null,""]
[1896,null,"Custom",null,null,""]
[1897,null,"Custom",null,null,""]
[1898,null,"Custom",null,null,""]
[1899,null,"Custom",null,null,""]
[1900,null,"Custom",null,null,""]
[1901,null,"Custom",null,null,""]
[1902,null,"Custom",null,null,""]
[1903,null,"Custom",null,null,""]
[1904,null,"Custom",null,null,""]
[1905,null,"Custom",null,null,""]
[1906,null,"Custom",null,null,""]
[1907,null,"Custom",null,null,""]
[1908,null,"Custom",null,null,""]
[1909,null,"Custom",null,null,""]
[1910,null,"Custom",null,null,""]
[1911,null,"Custom",null,null,""]
[1912,null,"Custom",null,null,""]
[1913,null,"Custom",null,null,""]
[1914,null,"Custom",null,null,""]
[1915,null,"Custom",null,null,""]
[1916,null,"Custom",null,null,""]
[1917,null,"Custom",null,null,""]
[1918,null,"Custom",null,null,""]
[{"$f":"A1922+1","v":1919},null,"Custom",null,null,""]
[1920,null,"Custom",null,null,""]
[1921,null,"Custom",null,null,""]
[1922,null,"Custom",null,null,""]
[1923,null,"Custom",null,null,""]
[1924,null,"Custom",null,null,""]
[1925,null,"Custom",null,null,""]
[1926,null,"Custom",null,null,""]
[1927,null,"Custom",null,null,""]
[1928,null,"Custom",null,null,""]
[1929,null,"Custom",null,null,""]
[1930,null,"Custom",null,null,""]
[1931,null,"Custom",null,null,""]
[1932,null,"Custom",null,null,""]
[1933,null,"Custom",null,null,""]
[1934,null,"Custom",null,null,""]
[1935,null,"Custom",null,null,""]
[1936,null,"Custom",null,null,""]
[1937,null,"Custom",null,null,""]
[1938,null,"Custom",null,null,""]
[1939,null,"Custom",null,null,""]
[1940,null,"Custom",null,null,""]
[1941,null,"Custom",null,null,""]
[1942,null,"Custom",null,null,""]
[1943,null,"Custom",null,null,""]
[1944,null,"Custom",null,null,""]
[1945,null,"Custom",null,null,""]
[1946,null,"Custom",null,null,""]
[1947,null,"Custom",null,null,""]
[1948,null,"Custom",null,null,""]
[1949,null,"Custom",null,null,""]
[1950,null,"Custom",null,null,""]
[1951,null,"Custom",null,null,""]
[1952,null,"Custom",null,null,""]
[1953,null,"Custom",null,null,""]
[1954,null,"Custom",null,null,""]
[1955,null,"Custom",null,null,""]
[1956,null,"Custom",null,null,""]
[1957,null,"Custom",null,null,""]
[1958,null,"Custom",null,null,{"$f":"IF(AND(B1963<>\"\",B1962=\"\"),\"Don't skip lines\",IF(AND(D1962=\"\",B1962<>\"\"),\"Enter U-value\",IF(AND(D1962<>\"\",B1962=\"\"),\"Enter Description\",\"\")))","v":""}]
[1959,null,"Custom",null,null,""]
[1960,null,"Custom",null,null,""]
[1961,null,"Custom",null,null,""]
[1962,null,"Custom",null,null,""]
[1963,null,"Custom",null,null,""]
[1964,null,"Custom",null,null,""]
[1965,null,"Custom",null,null,""]
[1966,null,"Custom",null,null,""]
[1967,null,"Custom",null,null,""]
[1968,null,"Custom",null,null,""]
[1969,null,"Custom",null,null,""]
[1970,null,"Custom",null,null,""]
[1971,null,"Custom",null,null,""]
[1972,null,"Custom",null,null,""]
[1973,null,"Custom",null,null,""]
[1974,null,"Custom",null,null,""]
[1975,null,"Custom",null,null,""]
[1976,null,"Custom",null,null,""]
[1977,null,"Custom",null,null,""]
[1978,null,"Custom",null,null,""]
[1979,null,"Custom",null,null,""]
[1980,null,"Custom",null,null,""]
[1981,null,"Custom",null,null,""]
[1982,null,"Custom",null,null,""]
[{"$f":"A1986+1","v":1983},null,"Custom",null,null,""]
[1984,null,"Custom",null,null,""]
[1985,null,"Custom",null,null,""]
[1986,null,"Custom",null,null,""]
[1987,null,"Custom",null,null,""]
[1988,null,"Custom",null,null,""]
[1989,null,"Custom",null,null,""]
[1990,null,"Custom",null,null,""]
[1991,null,"Custom",null,null,""]
[1992,null,"Custom",null,null,""]
[1993,null,"Custom",null,null,""]
[1994,null,"Custom",null,null,""]
[1995,null,"Custom",null,null,""]
[1996,null,"Custom",null,null,""]
[1997,null,"Custom",null,null,""]
[1998,null,"Custom",null,null,""]
[1999,null,"Custom",null,null,""]
[2000,null,"Custom",null,null,""]
[2001,null,"Custom",null,null,""]
[2002,null,"Custom",null,null,""]
[2003,null,"Custom",null,null,""]
[2004,null,"Custom",null,null,""]
[2005,null,"Custom",null,null,""]
[2006,null,"Custom",null,null,""]
[2007,null,"Custom",null,null,""]
[2008,null,"Custom",null,null,""]
[2009,null,"Custom",null,null,""]
[2010,null,"Custom",null,null,""]
[2011,null,"Custom",null,null,""]
[2012,null,"Custom",null,null,""]
[2013,null,"Custom",null,null,""]
[2014,null,"Custom",null,null,""]
[2015,null,"Custom",null,null,""]
[2016,null,"Custom",null,null,""]

{"sheet":"Doors","index":8,"n_rows":118,"n_cols":6,"rows_kept":118,"cut":false,"hidden":true,"merged":[]}
["WSU Code Compliance Calculator  - WSEC 2015 &2018",null,null,null,null,"(C) 2020"]
["Door Database"]
["Index","Component Description","Reference","U-Value"]
[]
[1,null,0,0]
[{"$f":"A5+1","v":2},"=== Most Frequently Used ========= "]
[{"$f":"A6+1","v":3},"Wood slab in wood frame (WoodSWF)","10-6C",{"$f":"VLOOKUP($B7,$B$20:$D$70,3,FALSE)","v":0.46}]
[4,"Code Baseline, U=0.30",null,0.3]
[5,"U=0.28",null,0.28000000000000003]
[6,"Insulated Steel, Wood Edge (ISteelWE)","10-6C",{"$f":"VLOOKUP($B10,$B$20:$D$70,3,FALSE)","v":0.16}]
[7,"ISteelWE 1gl 6% 22x8\"  ","10-6C",0.21]
[8,"ISteelWE 2gl 6% 22x8\" 1/4\" ","10-6C",0.2]
[9,"ISteelWE 2gl 25% 22x8\" 1/4\" ","10-6C",0.28000000000000003]
[10,"ISteelWE 2gl 6% 22x8\" 1/2\" ","10-6C",0.19]
[11,"ISteelWE 2gl 6% 22x8\" 1/2\" LowE.1 Ar ","10-6C",0.18]
[12,"ISteelWE2gl 25% 22x36\" 1/2\" LowE .1 Ar  ","10-6C",0.23]
[13,"ISteelWE2gl 45% 22x64\" 1/2\" LowE .1 Ar","10-6C",0.26]
[14,"2021 U-factor Baseline (Table R402.1.2)","Table R402.1.2",0.3]
[15,"============================"]
[16,"Wood slab in wood frame (WoodSWF)","10-6C",0.46]
[17,"WoodSWF 1gl 6% 22x8\"","10-6C",0.48]
[18,"WoodSWF 1gl 25% 22x36\"","10-6C",0.57999999999999996]
[19,"WoodSWF 1gl 45% 22x64\" ","10-6C",0.69]
[20,"WoodSWF 1gl >50% ","10-6A",1.2]
[21,"WoodSWF 2gl 6% 22x8\" 1/4\" ","10-6C",0.47]
[22,"WoodSWF 2gl 25% 22x8\" 1/4\" ","10-6C",0.48]
[{"$f":"A26+1","v":23},"WoodSWF 2gl 45% 22x8\" 1/4\" ","10-6C",0.49]
[24,"WoodSWF 2gl >50% 1/4\" ","10-6A",0.63]
[25,"WoodSWF 2gl 6% 22x8\" 1/2\" ","10-6C",0.46]
[26,"WoodSWF 2gl 25% 22x8\" 1/2\" ","10-6C",0.46]
[27,"WoodSWF 2gl 45% 22x8\" 1/2\" ","10-6C",0.46]
[28,"WoodSWF 2gl >50% 1/2\" ","10-6A",0.57999999999999996]
[29,"WoodSWF 2gl 6% 22x8\" 1/2\" LowE.1 Ar ","10-6C",0.44]
[30,"WoodSWF2gl 25% 22x36\" 1/2\" LowE .1 Ar  ","10-6C",0.42]
[31,"WoodSWF2gl 45% 22x64\" 1/2\" LowE .1 Ar","10-6C",0.39]
[32,"WoodSWF 2gl >50% 1/2\" LowE .1 Ar ","10-6A",0.48]
[33,"Insulated Steel, Wood Edge (ISteelWE)","10-6C",0.16]
[34,"ISteelWE 1gl 6% 22x8\"  ","10-6C",0.21]
[35,"ISteelWE 1gl 25% 22x36\"","10-6C",0.39]
[36,"ISteelWE 1gl 45% 22x64\"","10-6C",0.57999999999999996]
[37,"ISteelWE 1gl >50% ","10-6A",1.2]
[38,"ISteelWE 2gl 6% 22x8\" 1/4\" ","10-6C",0.2]
[39,"ISteelWE 2gl 25% 22x8\" 1/4\" ","10-6C",0.28000000000000003]
[40,"ISteelWE 2gl 45% 22x8\" 1/4\" ","10-6C",0.38]
[41,"ISteelWE 2gl >50% 1/4\" ","10-6A",0.63]
[42,"ISteelWE 2gl 6% 22x8\" 1/2\" ","10-6C",0.19]
[43,"ISteelWE 2gl 25% 22x8\" 1/2\" ","10-6C",0.26]
[44,"ISteelWE 2gl 45% 22x8\" 1/2\" ","10-6C",0.35]
[45,"ISteelWE 2gl >50% 1/2\" ","10-6A",0.57999999999999996]
[46,"ISteelWE 2gl 6% 22x8\" 1/2\" LowE.1 Ar ","10-6C",0.18]
[47,"ISteelWE2gl 25% 22x36\" 1/2\" LowE .1 Ar  ","10-6C",0.23]
[48,"ISteelWE2gl 45% 22x64\" 1/2\" LowE .1 Ar","10-6C",0.26]
[49,"ISteelWE 2gl >50% 1/2\" LowE .1 Ar","10-6A",0.48]
[50,"Insulated Steel, Steel Edge Steel Frame (ISteel,SEdge,SFrame)","10-6C",0.37]
[51,"ISteel,SEdge,SFrame 1gl 6% 22x8\"","10-6C",0.44]
[52,"ISteel,SEdge,SFrame 1gl 25% 22x36\"","10-6C",0.55000000000000004]
[53,"ISteel,SEdge,SFrame 1gl 45% 22x64\"","10-6C",0.71]
[54,"ISteel,SEdge,SFrame 1gl > 50%","10-6A",1.2]
[55,"ISteel,SEdge,SFrame 2gl 6% 22x8\"  1/4\"","10-6C",0.42]
[56,"ISteel,SEdge,SFrame 2gl 25% 22x36\" 1/4\" ","10-6C",0.5]
[57,"ISteel,SEdge,SFrame 2gl 45% 22x64\" 1/4\" ","10-6C",0.59]
[58,"ISteel,SEdge,SFrame 2gl > 50% 1/4\"","10-6A",0.92]
[59,"ISteel,SEdge,SFrame 2gl 6% 22x8\" 1/2\" ","10-6C",0.41]
[60,"ISteel,SEdge,SFrame 2gl 25% 22x36\"  1/2\" ","10-6C",0.48]
[61,"ISteel,SEdge,SFrame 2gl 45% 22x64\"  1/2\" ","10-6C",0.56000000000000005]
[62,"ISteel,SEdge,SFrame 2gl > 50% 1/2\"","10-6A",0.86]
[63,"ISteel,SEdge,SFrame 2gl 6% 22x8\" 1/2\" LowE.1 Ar","10-6C",0.39]
[64,"ISteel,SEdge,SFrame 2gl 25% 22x36\" 1/2\" LowE .1 Ar","10-6C",0.44]
[65,"ISteel,SEdge,SFrame 2gl 45% 22x64\" 1/2\" LowE .1 Ar","10-6C",0.48]
[66,"ISteel,SEdge,SFrame 2gl > 50% 1/2\" LowE .1 Ar","10-6A",0.79]
[67,{"$f":"'Flat-Vaulted Ceilings'!B339","v":"== Custom Entries per WSEC R402.1.5 U-factor Reference and Calculations ========  "},null,"U-Value","Notes",{"$f":"'Flat-Vaulted Ceilings'!$F$339","v":"Your entries appear at bottom of drowdown menus on \"Group R\" tab"}]
[68,"Manufacturer ABC, Model X","Custom",0.27,"mnf",{"$f":"IF(AND(B73<>\"\",B72=\"\"),\"Don't skip lines\",IF(AND(D72=\"\",B72<>\"\"),\"Enter U-value\",IF(AND(D72<>\"\",B72=\"\"),\"Enter Description\",\"\")))","v":""}]
[69,"Fiberglass with 10% glazing","Custom",0.3,null,""]
[70,"Sliding Glass, Default Nonmetal or Metal Clad, Double Pane","Custom",0.55000000000000004,null,""]
[71,"U=0.16","Custom",0.16,null,""]
[72,"Solid Core Door","Custom",0.17,null,""]
[73,"Entry Door","Custom",0.18,null,""]
[74,"French/Glass Door","Custom",0.27,null,""]
[75,"Sliding Door","Custom",0.28999999999999998,null,""]
[76,"Fiberglass Door","Custom",0.15,null,""]
[77,null,"Custom",null,null,""]
[78,null,"Custom",null,null,""]
[79,null,"Custom",null,null,""]
[80,null,"Custom",null,null,""]
[81,null,"Custom",null,null,""]
[82,null,"Custom",null,null,""]
[83,null,"Custom",null,null,""]
[{"$f":"A87+1","v":84},null,"Custom",null,null,""]
[85,null,"Custom",null,null,""]
[86,null,"Custom",null,null,""]
[87,null,"Custom",null,null,""]
[88,null,"Custom",null,null,""]
[89,null,"Custom",null,null,""]
[90,null,"Custom",null,null,""]
[91,null,"Custom",null,null,""]
[92,null,"Custom",null,null,""]
[93,null,"Custom",null,null,""]
[94,null,"Custom",null,null,""]
[95,null,"Custom",null,null,""]
[96,null,"Custom",null,null,""]
[97,null,"Custom",null,null,""]
[98,null,"Custom",null,null,""]
[99,null,"Custom",null,null,""]
[100,null,"Custom",null,null,""]
[101,null,"Custom",null,null,""]
[102,null,"Custom",null,null,""]
[103,null,"Custom",null,null,""]
[104,null,"Custom",null,null,""]
[105,null,"Custom",null,null,""]
[106,null,"Custom",null,null,""]
[107,null,"Custom",null,null,""]
[108,null,"Custom",null,null,""]
[109,null,"Custom",null,null,""]
[110,null,"Custom",null,null,""]
[111,null,"Custom",null,null,""]
[112,null,"Custom",null,null,""]
[113,null,"Custom",null,null,""]
[114,null,"Custom",null,null,""]

{"sheet":"Flat-Vaulted Ceilings","index":9,"n_rows":379,"n_cols":6,"rows_kept":379,"cut":false,"hidden":true,"merged":[]}
["WSU Code Compliance Calculator  - WSEC 2015 &2018",null,null,null,null,"(C) 2020"]
["Flat & Vaulted Ceilings Database"]
["Index","Component Description","Reference","Attic U"]
[]
[1]
[{"$f":"A5+1","v":2},"=== Most Frequently Used ========= "]
[{"$f":"A6+1","v":3},"R0 Attic","WSU",0.30199999999999999]
[4,"R0 Scissors","WSU",0.28399999999999997]
[5,"R19 blown Attic STD baffled","10-7",4.9000000000000002E-2]
[6,"R30 blown Attic STD baffled","10-7",3.5999999999999997E-2]
[7,"R38 blown Attic ADV baffled (2018 Code Baseline, 1.1-1.4)","10-7",2.5999999999999999E-2]
[8,"R49 blown Attic STD baffled (2018 Code Baseline, 1.1-1.4)","10-7",2.7E-2]
[9,"R49 blown Attic ADV baffled (2018 1.5, 1.7, 2021 Code Baseline)","10-7",0.02]
[10,"R60 blown Attic STD baffled","10-7",2.5000000000000001E-2]
[11,"R60 blown Attic ADV baffled (2021 1.3, 1.4; 2018 1.6)","10-7",1.7000000000000001E-2]
[12,"R38 blown Scissor 4:12 ADV baffled","10-7",2.5000000000000001E-2]
[13,"R49 blown Scissor 4:12 ADV baffled (2018 1.7)","10-7",0.02]
[14,"R38 blown Scissor 5:12 ADV baffled","10-7",2.5999999999999999E-2]
[15,"R49 blown Scissor 5:12 ADV baffled","10-7",0.02]
[16,"R19 batt Vault vented 2x10 16oc","10-7",4.9000000000000002E-2]
[{"$f":"A19+1","v":16},"R19 batt Vault vented 2x10 24oc","10-7",4.8000000000000001E-2]
[17,"R30 batt Vault vented 2x12 16oc","10-7",3.4000000000000002E-2]
[18,"R30 batt Vault vented 2x12 24oc","10-7",3.3000000000000002E-2]
[19,"R38 batt Vault vented 2x14 16oc (2018 Code Baseline)","10-7",2.7E-2]
[20,"R38 batt Vault vented 2x14 24oc (2018 Code Baseline)","10-7",2.7E-2]
[21,"R49 batt Vault  24oc","-",0.02]
[22,"R60 batt Vault  24oc","-",1.7000000000000001E-2]
[{"$f":"A25+1","v":21},"No ceiling/roof in thermal envelope","NA",0]
[{"$f":"A26+1","v":22},"2021 U-factor Baseline (Table R402.1.2)","Table R402.1.2",2.4E-2]
[{"$f":"A27+1","v":23},"============================","NA"]
[24,"R0 Attic","WSU",0.30199999999999999]
[{"$f":"A31+1","v":25},"R0 Scissors","WSU",0.28399999999999997]
[26,"R19 blown Attic STD baffled","10-7",4.9000000000000002E-2]
[27,"R19 blown Attic ADV baffled","10-7",4.7E-2]
[28,"R30 blown Attic STD baffled","10-7",3.5999999999999997E-2]
[29,"R30 blown Attic ADV baffled","10-7",3.2000000000000001E-2]
[30,"R38 blown Attic STD baffled","10-7",3.1E-2]
[31,"R38 blown Attic ADV baffled","10-7",2.5999999999999999E-2]
[32,"R49 blown Attic STD baffled","10-7",2.7E-2]
[33,"R49 blown Attic ADV baffled","10-7",0.02]
[34,"R60 blown Attic STD baffled","10-7",2.4E-2]
[35,"R60 blown Attic ADV baffled","10-7",1.7000000000000001E-2]
[36,"R30 blown Scissor 4:12 STD baffled","10-7",4.2999999999999997E-2]
[37,"R30 blown Scissor 4:12 ADV baffled","10-7",3.1E-2]
[38,"R38 blown Scissor 4:12 STD baffled","10-7",0.04]
[39,"R38 blown Scissor 4:12 ADV baffled","10-7",2.5000000000000001E-2]
[40,"R49 blown Scissor 4:12 STD baffled","10-7",3.7999999999999999E-2]
[41,"R49 blown Scissor 4:12 ADV baffled","10-7",0.02]
[42,"R30 blown Scissor 5:12 STD baffled","10-7",3.9E-2]
[43,"R30 blown Scissor 5:12 ADV baffled","10-7",3.2000000000000001E-2]
[44,"R38 blown Scissor 5:12 STD baffled","10-7",3.5000000000000003E-2]
[45,"R38 blown Scissor 5:12 ADV baffled","10-7",2.5999999999999999E-2]
[46,"R49 blown Scissor 5:12 STD baffled","10-7",3.2000000000000001E-2]
[47,"R49 blown Scissor 5:12 ADV baffled","10-7",0.02]
[48,"St Truss R19 cavity 12' Span","10-7A",0.1075]
[49,"St Truss R19 cavity 14' Span","10-7A",9.9099999999999994E-2]
[50,"St Truss R19 cavity 16' Span","10-7A",9.2799999999999994E-2]
[51,"St Truss R19 cavity 18' Span","10-7A",8.7800000000000003E-2]
[52,"St Truss R19 cavity 20' Span","10-7A",8.3900000000000002E-2]
[53,"St Truss R19 cavity 22' Span","10-7A",8.0699999999999994E-2]
[54,"St Truss R19 cavity 24' Span","10-7A",7.8E-2]
[55,"St Truss R19 cavity 26' Span","10-7A",7.5700000000000003E-2]
[56,"St Truss R19 cavity 28' Span","10-7A",7.3700000000000002E-2]
[57,"St Truss R19 cavity 30' Span","10-7A",7.1999999999999995E-2]
[58,"St Truss R19 cavity 32' Span","10-7A",7.0599999999999996E-2]
[59,"St Truss R19 cavity 34' Span","10-7A",6.93E-2]
[60,"St Truss R19 cavity 36' Span","10-7A",6.8099999999999994E-2]
[61,"St Truss R30 cavity 12' Span","10-7A",9.0700000000000003E-2]
[62,"St Truss R30 cavity 14' Span","10-7A",8.2299999999999998E-2]
[63,"St Truss R30 cavity 16' Span","10-7A",7.5999999999999998E-2]
[64,"St Truss R30 cavity 18' Span","10-7A",7.0999999999999994E-2]
[65,"St Truss R30 cavity 20' Span","10-7A",6.7100000000000007E-2]
[66,"St Truss R30 cavity 22' Span","10-7A",6.3799999999999996E-2]
[67,"St Truss R30 cavity 24' Span","10-7A",6.1199999999999997E-2]
[68,"St Truss R30 cavity 26' Span","10-7A",5.8900000000000001E-2]
[69,"St Truss R30 cavity 28' Span","10-7A",5.6899999999999999E-2]
[70,"St Truss R30 cavity 30' Span","10-7A",5.5199999999999999E-2]
[71,"St Truss R30 cavity 32' Span","10-7A",5.3800000000000001E-2]
[72,"St Truss R30 cavity 34' Span","10-7A",5.2499999999999998E-2]
[73,"St Truss R30 cavity 36' Span","10-7A",5.1299999999999998E-2]
[74,"St Truss R38 cavity 12' Span","10-7A",8.4400000000000003E-2]
[75,"St Truss R38 cavity 14' Span","10-7A",7.5899999999999995E-2]
[76,"St Truss R38 cavity 16' Span","10-7A",6.9599999999999995E-2]
[77,"St Truss R38 cavity 18' Span","10-7A",6.4699999999999994E-2]
[{"$f":"A84+1","v":78},"St Truss R38 cavity 20' Span","10-7A",6.0699999999999997E-2]
[79,"St Truss R38 cavity 22' Span","10-7A",5.7500000000000002E-2]
[80,"St Truss R38 cavity 24' Span","10-7A",5.4800000000000001E-2]
[81,"St Truss R38 cavity 26' Span","10-7A",5.2499999999999998E-2]
[82,"St Truss R38 cavity 28' Span","10-7A",5.0599999999999999E-2]
[83,"St Truss R38 cavity 30' Span","10-7A",4.8899999999999999E-2]
[84,"St Truss R38 cavity 32' Span","10-7A",4.7399999999999998E-2]
[85,"St Truss R38 cavity 34' Span","10-7A",4.6100000000000002E-2]
[86,"St Truss R38 cavity 36' Span","10-7A",4.4900000000000002E-2]
[87,"St Truss R49 cavity 12' Span","10-7A",7.8899999999999998E-2]
[88,"St Truss R49 cavity 14' Span","10-7A",7.0400000000000004E-2]
[89,"St Truss R49 cavity 16' Span","10-7A",6.4100000000000004E-2]
[90,"St Truss R49 cavity 18' Span","10-7A",5.9200000000000003E-2]
[91,"St Truss R49 cavity 20' Span","10-7A",5.5199999999999999E-2]
[92,"St Truss R49 cavity 22' Span","10-7A",5.1999999999999998E-2]
[93,"St Truss R49 cavity 24' Span","10-7A",4.9299999999999997E-2]
[94,"St Truss R49 cavity 26' Span","10-7A",4.7E-2]
[95,"St Truss R49 cavity 28' Span","10-7A",4.5100000000000001E-2]
[96,"St Truss R49 cavity 30' Span","10-7A",4.3400000000000001E-2]
[97,"St Truss R49 cavity 32' Span","10-7A",4.19E-2]
[98,"St Truss R49 cavity 34' Span","10-7A",4.0599999999999997E-2]
[99,"St Truss R49 cavity 36' Span","10-7A",3.95E-2]
[100,"St Truss R19 cavity R3 Sheath 12' Span","10-7A",8.09E-2]
[101,"St Truss R19 cavity R3 Sheath 14' Span","10-7A",7.6300000000000007E-2]
[102,"St Truss R19 cavity R3 Sheath 16' Span","10-7A",7.2800000000000004E-2]
[103,"St Truss R19 cavity R3 Sheath 18' Span","10-7A",7.0099999999999996E-2]
[104,"St Truss R19 cavity R3 Sheath 20' Span","10-7A",6.7900000000000002E-2]
[105,"St Truss R19 cavity R3 Sheath 22' Span","10-7A",6.6100000000000006E-2]
[106,"St Truss R19 cavity R3 Sheath 24' Span","10-7A",6.4699999999999994E-2]
[107,"St Truss R19 cavity R3 Sheath 26' Span","10-7A",6.3399999999999998E-2]
[108,"St Truss R19 cavity R3 Sheath 28' Span","10-7A",6.2300000000000001E-2]
[109,"St Truss R19 cavity R3 Sheath 30' Span","10-7A",6.1400000000000003E-2]
[110,"St Truss R19 cavity R3 Sheath 32' Span","10-7A",6.0600000000000001E-2]
[111,"St Truss R19 cavity R3 Sheath 34' Span","10-7A",5.9900000000000002E-2]
[112,"St Truss R19 cavity R3 Sheath 36' Span","10-7A",5.9200000000000003E-2]
[113,"St Truss R30 cavity R3 Sheath 12' Span","10-7A",6.4100000000000004E-2]
[114,"St Truss R30 cavity R3 Sheath 14' Span","10-7A",5.9499999999999997E-2]
[115,"St Truss R30 cavity R3 Sheath 16' Span","10-7A",5.6000000000000001E-2]
[116,"St Truss R30 cavity R3 Sheath 18' Span","10-7A",5.33E-2]
[117,"St Truss R30 cavity R3 Sheath 20' Span","10-7A",5.11E-2]
[118,"St Truss R30 cavity R3 Sheath 22' Span","10-7A",4.9299999999999997E-2]
[119,"St Truss R30 cavity R3 Sheath 24' Span","10-7A",4.7800000000000002E-2]
[120,"St Truss R30 cavity R3 Sheath 26' Span","10-7A",4.6600000000000003E-2]
[121,"St Truss R30 cavity R3 Sheath 28' Span","10-7A",4.5499999999999999E-2]
[122,"St Truss R30 cavity R3 Sheath 30' Span","10-7A",4.4600000000000001E-2]
[123,"St Truss R30 cavity R3 Sheath 32' Span","10-7A",4.3799999999999999E-2]
[124,"St Truss R30 cavity R3 Sheath 34' Span","10-7A",4.3099999999999999E-2]
[125,"St Truss R30 cavity R3 Sheath 36' Span","10-7A",4.24E-2]
[126,"St Truss R38 cavity R3 Sheath 12' Span","10-7A",5.7700000000000001E-2]
[127,"St Truss R38 cavity R3 Sheath 14' Span","10-7A",5.3100000000000001E-2]
[128,"St Truss R38 cavity R3 Sheath 16' Span","10-7A",4.9599999999999998E-2]
[129,"St Truss R38 cavity R3 Sheath 18' Span","10-7A",4.6899999999999997E-2]
[130,"St Truss R38 cavity R3 Sheath 20' Span","10-7A",4.4699999999999997E-2]
[131,"St Truss R38 cavity R3 Sheath 22' Span","10-7A",4.2999999999999997E-2]
[132,"St Truss R38 cavity R3 Sheath 24' Span","10-7A",4.1500000000000002E-2]
[133,"St Truss R38 cavity R3 Sheath 26' Span","10-7A",4.02E-2]
[134,"St Truss R38 cavity R3 Sheath 28' Span","10-7A",3.9199999999999999E-2]
[135,"St Truss R38 cavity R3 Sheath 30' Span","10-7A",3.8199999999999998E-2]
[136,"St Truss R38 cavity R3 Sheath 32' Span","10-7A",3.7400000000000003E-2]
[137,"St Truss R38 cavity R3 Sheath 34' Span","10-7A",3.6700000000000003E-2]
[138,"St Truss R38 cavity R3 Sheath 36' Span","10-7A",3.61E-2]
[139,"St Truss R49 cavity R3 Sheath 12' Span","10-7A",5.2299999999999999E-2]
[140,"St Truss R49 cavity R3 Sheath 14' Span","10-7A",4.7600000000000003E-2]
[141,"St Truss R49 cavity R3 Sheath 16' Span","10-7A",4.41E-2]
[{"$f":"A148+1","v":142},"St Truss R49 cavity R3 Sheath 18' Span","10-7A",4.1399999999999999E-2]
[143,"St Truss R49 cavity R3 Sheath 20' Span","10-7A",3.9300000000000002E-2]
[144,"St Truss R49 cavity R3 Sheath 22' Span","10-7A",3.7499999999999999E-2]
[145,"St Truss R49 cavity R3 Sheath 24' Span","10-7A",3.5999999999999997E-2]
[146,"St Truss R49 cavity R3 Sheath 26' Span","10-7A",3.4799999999999998E-2]
[147,"St Truss R49 cavity R3 Sheath 28' Span","10-7A",3.3700000000000001E-2]
[148,"St Truss R49 cavity R3 Sheath 30' Span","10-7A",3.2800000000000003E-2]
[149,"St Truss R49 cavity R3 Sheath 32' Span","10-7A",3.1899999999999998E-2]
[150,"St Truss R49 cavity R3 Sheath 34' Span","10-7A",3.1199999999999999E-2]
[151,"St Truss R49 cavity R3 Sheath 36' Span","10-7A",3.0599999999999999E-2]
[152,"St Truss R19 cavity R5 Sheath 12' Span","10-7A",7.3200000000000001E-2]
[153,"St Truss R19 cavity R5 Sheath 14' Span","10-7A",6.9699999999999998E-2]
[154,"St Truss R19 cavity R5 Sheath 16' Span","10-7A",6.7000000000000004E-2]
[155,"St Truss R19 cavity R5 Sheath 18' Span","10-7A",6.4899999999999999E-2]
[156,"St Truss R19 cavity R5 Sheath 20' Span","10-7A",6.3299999999999995E-2]
[157,"St Truss R19 cavity R5 Sheath 22' Span","10-7A",6.1899999999999997E-2]
[158,"St Truss R19 cavity R5 Sheath 24' Span","10-7A",6.08E-2]
[159,"St Truss R19 cavity R5 Sheath 26' Span","10-7A",5.9799999999999999E-2]
[160,"St Truss R19 cavity R5 Sheath 28' Span","10-7A",5.8999999999999997E-2]
[161,"St Truss R19 cavity R5 Sheath 30' Span","10-7A",5.8299999999999998E-2]
[162,"St Truss R19 cavity R5 Sheath 32' Span","10-7A",5.7700000000000001E-2]
[163,"St Truss R19 cavity R5 Sheath 34' Span","10-7A",5.7099999999999998E-2]
[164,"St Truss R19 cavity R5 Sheath 36' Span","10-7A",5.67E-2]
[165,"St Truss R30 cavity R5 Sheath 12' Span","10-7A",5.6399999999999999E-2]
[166,"St Truss R30 cavity R5 Sheath 14' Span","10-7A",5.2900000000000003E-2]
[167,"St Truss R30 cavity R5 Sheath 16' Span","10-7A",5.0200000000000002E-2]
[168,"St Truss R30 cavity R5 Sheath 18' Span","10-7A",4.8099999999999997E-2]
[169,"St Truss R30 cavity R5 Sheath 20' Span","10-7A",4.65E-2]
[170,"St Truss R30 cavity R5 Sheath 22' Span","10-7A",5.0999999999999997E-2]
[171,"St Truss R30 cavity R5 Sheath 24' Span","10-7A",4.3999999999999997E-2]
[172,"St Truss R30 cavity R5 Sheath 26' Span","10-7A",4.2999999999999997E-2]
[173,"St Truss R30 cavity R5 Sheath 28' Span","10-7A",4.2200000000000001E-2]
[174,"St Truss R30 cavity R5 Sheath 30' Span","10-7A",4.1500000000000002E-2]
[175,"St Truss R30 cavity R5 Sheath 32' Span","10-7A",4.0899999999999999E-2]
[176,"St Truss R30 cavity R5 Sheath 34' Span","10-7A",4.0300000000000002E-2]
[177,"St Truss R30 cavity R5 Sheath 36' Span","10-7A",3.9899999999999998E-2]
[178,"St Truss R38 cavity R5 Sheath 12' Span","10-7A",5.0099999999999999E-2]
[179,"St Truss R38 cavity R5 Sheath 14' Span","10-7A",4.65E-2]
[180,"St Truss R38 cavity R5 Sheath 16' Span","10-7A",4.3799999999999999E-2]
[181,"St Truss R38 cavity R5 Sheath 18' Span","10-7A",4.1799999999999997E-2]
[182,"St Truss R38 cavity R5 Sheath 20' Span","10-7A",4.0099999999999997E-2]
[183,"St Truss R38 cavity R5 Sheath 22' Span","10-7A",3.8800000000000001E-2]
[184,"St Truss R38 cavity R5 Sheath 24' Span","10-7A",3.7600000000000001E-2]
[185,"St Truss R38 cavity R5 Sheath 26' Span","10-7A",3.6700000000000003E-2]
[186,"St Truss R38 cavity R5 Sheath 28' Span","10-7A",3.5900000000000001E-2]
[187,"St Truss R38 cavity R5 Sheath 30' Span","10-7A",3.5099999999999999E-2]
[188,"St Truss R38 cavity R5 Sheath 32' Span","10-7A",3.4500000000000003E-2]
[189,"St Truss R38 cavity R5 Sheath 34' Span","10-7A",3.4000000000000002E-2]
[190,"St Truss R38 cavity R5 Sheath 36' Span","10-7A",3.3500000000000002E-2]
[191,"St Truss R49 cavity R5 Sheath 12' Span","10-7A",4.4600000000000001E-2]
[192,"St Truss R49 cavity R5 Sheath 14' Span","10-7A",4.1000000000000002E-2]
[193,"St Truss R49 cavity R5 Sheath 16' Span","10-7A",3.8399999999999997E-2]
[194,"St Truss R49 cavity R5 Sheath 18' Span","10-7A",3.6299999999999999E-2]
[195,"St Truss R49 cavity R5 Sheath 20' Span","10-7A",3.4599999999999999E-2]
[196,"St Truss R49 cavity R5 Sheath 22' Span","10-7A",3.3300000000000003E-2]
[197,"St Truss R49 cavity R5 Sheath 24' Span","10-7A",3.2199999999999999E-2]
[198,"St Truss R49 cavity R5 Sheath 26' Span","10-7A",3.1199999999999999E-2]
[199,"St Truss R49 cavity R5 Sheath 28' Span","10-7A",3.04E-2]
[200,"St Truss R49 cavity R5 Sheath 30' Span","10-7A",2.9700000000000001E-2]
[201,"St Truss R49 cavity R5 Sheath 32' Span","10-7A",2.9100000000000001E-2]
[202,"St Truss R49 cavity R5 Sheath 34' Span","10-7A",2.8500000000000001E-2]
[203,"St Truss R49 cavity R5 Sheath 36' Span","10-7A",2.8000000000000001E-2]
[204,"St Truss R19 cavity R10 Sheath 12' Span","10-7A",6.2600000000000003E-2]
[205,"St Truss R19 cavity R10 Sheath 14' Span","10-7A",6.0600000000000001E-2]
[{"$f":"A212+1","v":206},"St Truss R19 cavity R10 Sheath 16' Span","10-7A",5.8999999999999997E-2]
[207,"St Truss R19 cavity R10 Sheath 18' Span","10-7A",5.7799999999999997E-2]
[208,"St Truss R19 cavity R10 Sheath 20' Span","10-7A",5.6899999999999999E-2]
[209,"St Truss R19 cavity R10 Sheath 22' Span","10-7A",5.6099999999999997E-2]
[210,"St Truss R19 cavity R10 Sheath 24' Span","10-7A",5.5500000000000001E-2]
[211,"St Truss R19 cavity R10 Sheath 26' Span","10-7A",5.4899999999999997E-2]
[212,"St Truss R19 cavity R10 Sheath 28' Span","10-7A",5.45E-2]
[213,"St Truss R19 cavity R10 Sheath 30' Span","10-7A",5.4100000000000002E-2]
[214,"St Truss R19 cavity R10 Sheath 32' Span","10-7A",5.3699999999999998E-2]
[215,"St Truss R19 cavity R10 Sheath 34' Span","10-7A",5.3400000000000003E-2]
[216,"St Truss R19 cavity R10 Sheath 36' Span","10-7A",5.3100000000000001E-2]
[217,"St Truss R30 cavity R10 Sheath 12' Span","10-7A",4.58E-2]
[218,"St Truss R30 cavity R10 Sheath 14' Span","10-7A",4.3700000000000003E-2]
[219,"St Truss R30 cavity R10 Sheath 16' Span","10-7A",4.2200000000000001E-2]
[220,"St Truss R30 cavity R10 Sheath 18' Span","10-7A",4.1000000000000002E-2]
[221,"St Truss R30 cavity R10 Sheath 20' Span","10-7A",4.0099999999999997E-2]
[222,"St Truss R30 cavity R10 Sheath 22' Span","10-7A",3.9300000000000002E-2]
[223,"St Truss R30 cavity R10 Sheath 24' Span","10-7A",3.8699999999999998E-2]
[224,"St Truss R30 cavity R10 Sheath 26' Span","10-7A",3.8100000000000002E-2]
[225,"St Truss R30 cavity R10 Sheath 28' Span","10-7A",3.7699999999999997E-2]
[226,"St Truss R30 cavity R10 Sheath 30' Span","10-7A",3.73E-2]
[227,"St Truss R30 cavity R10 Sheath 32' Span","10-7A",3.6900000000000002E-2]
[228,"St Truss R30 cavity R10 Sheath 34' Span","10-7A",3.6600000000000001E-2]
[229,"St Truss R30 cavity R10 Sheath 36' Span","10-7A",3.6299999999999999E-2]
[230,"St Truss R38 cavity R10 Sheath 12' Span","10-7A",3.9399999999999998E-2]
[231,"St Truss R38 cavity R10 Sheath 14' Span","10-7A",3.7400000000000003E-2]
[232,"St Truss R38 cavity R10 Sheath 16' Span","10-7A",3.5900000000000001E-2]
[233,"St Truss R38 cavity R10 Sheath 18' Span","10-7A",3.4700000000000002E-2]
[234,"St Truss R38 cavity R10 Sheath 20' Span","10-7A",3.3700000000000001E-2]
[235,"St Truss R38 cavity R10 Sheath 22' Span","10-7A",3.3000000000000002E-2]
[236,"St Truss R38 cavity R10 Sheath 24' Span","10-7A",3.2300000000000002E-2]
[237,"St Truss R38 cavity R10 Sheath 26' Span","10-7A",3.1800000000000002E-2]
[238,"St Truss R38 cavity R10 Sheath 28' Span","10-7A",3.1300000000000001E-2]
[239,"St Truss R38 cavity R10 Sheath 30' Span","10-7A",3.09E-2]
[240,"St Truss R38 cavity R10 Sheath 32' Span","10-7A",3.0499999999999999E-2]
[241,"St Truss R38 cavity R10 Sheath 34' Span","10-7A",3.0200000000000001E-2]
[242,"St Truss R38 cavity R10 Sheath 36' Span","10-7A",2.9899999999999999E-2]
[243,"St Truss R49 cavity R10 Sheath 12' Span","10-7A",3.39E-2]
[244,"St Truss R49 cavity R10 Sheath 14' Span","10-7A",3.1899999999999998E-2]
[245,"St Truss R49 cavity R10 Sheath 16' Span","10-7A",3.04E-2]
[246,"St Truss R49 cavity R10 Sheath 18' Span","10-7A",2.92E-2]
[247,"St Truss R49 cavity R10 Sheath 20' Span","10-7A",2.8299999999999999E-2]
[248,"St Truss R49 cavity R10 Sheath 22' Span","10-7A",2.75E-2]
[249,"St Truss R49 cavity R10 Sheath 24' Span","10-7A",2.6800000000000001E-2]
[250,"St Truss R49 cavity R10 Sheath 26' Span","10-7A",2.63E-2]
[251,"St Truss R49 cavity R10 Sheath 28' Span","10-7A",2.58E-2]
[252,"St Truss R49 cavity R10 Sheath 30' Span","10-7A",2.5399999999999999E-2]
[253,"St Truss R49 cavity R10 Sheath 32' Span","10-7A",2.5100000000000001E-2]
[254,"St Truss R49 cavity R10 Sheath 34' Span","10-7A",2.47E-2]
[255,"St Truss R49 cavity R10 Sheath 36' Span","10-7A",2.4500000000000001E-2]
[256,"St Truss R19 cavity R15 Sheath 12' Span","10-7A",5.6099999999999997E-2]
[257,"St Truss R19 cavity R15 Sheath 14' Span","10-7A",5.5E-2]
[258,"St Truss R19 cavity R15 Sheath 16' Span","10-7A",5.4100000000000002E-2]
[259,"St Truss R19 cavity R15 Sheath 18' Span","10-7A",5.3499999999999999E-2]
[260,"St Truss R19 cavity R15 Sheath 20' Span","10-7A",5.2999999999999999E-2]
[261,"St Truss R19 cavity R15 Sheath 22' Span","10-7A",5.2600000000000001E-2]
[262,"St Truss R19 cavity R15 Sheath 24' Span","10-7A",5.2200000000000003E-2]
[263,"St Truss R19 cavity R15 Sheath 26' Span","10-7A",5.1900000000000002E-2]
[264,"St Truss R19 cavity R15 Sheath 28' Span","10-7A",5.1700000000000003E-2]
[265,"St Truss R19 cavity R15 Sheath 30' Span","10-7A",5.1499999999999997E-2]
[266,"St Truss R19 cavity R15 Sheath 32' Span","10-7A",5.1299999999999998E-2]
[267,"St Truss R19 cavity R15 Sheath 34' Span","10-7A",5.11E-2]
[268,"St Truss R19 cavity R15 Sheath 36' Span","10-7A",5.0900000000000001E-2]
[269,"St Truss R30 cavity R15 Sheath 12' Span","10-7A",3.9300000000000002E-2]
[{"$f":"A276+1","v":270},"St Truss R30 cavity R15 Sheath 14' Span","10-7A",3.8199999999999998E-2]
[271,"St Truss R30 cavity R15 Sheath 16' Span","10-7A",3.73E-2]
[272,"St Truss R30 cavity R15 Sheath 18' Span","10-7A",3.6700000000000003E-2]
[273,"St Truss R30 cavity R15 Sheath 20' Span","10-7A",3.6200000000000003E-2]
[274,"St Truss R30 cavity R15 Sheath 22' Span","10-7A",3.5799999999999998E-2]
[275,"St Truss R30 cavity R15 Sheath 24' Span","10-7A",3.5400000000000001E-2]
[276,"St Truss R30 cavity R15 Sheath 26' Span","10-7A",3.5099999999999999E-2]
[277,"St Truss R30 cavity R15 Sheath 28' Span","10-7A",3.49E-2]
[278,"St Truss R30 cavity R15 Sheath 30' Span","10-7A",3.4700000000000002E-2]
[279,"St Truss R30 cavity R15 Sheath 32' Span","10-7A",3.4500000000000003E-2]
[280,"St Truss R30 cavity R15 Sheath 34' Span","10-7A",3.4299999999999997E-2]
[281,"St Truss R30 cavity R15 Sheath 36' Span","10-7A",3.4099999999999998E-2]
[282,"St Truss R38 cavity R15 Sheath 12' Span","10-7A",3.2899999999999999E-2]
[283,"St Truss R38 cavity R15 Sheath 14' Span","10-7A",3.1800000000000002E-2]
[284,"St Truss R38 cavity R15 Sheath 16' Span","10-7A",3.1E-2]
[285,"St Truss R38 cavity R15 Sheath 18' Span","10-7A",3.0300000000000001E-2]
[286,"St Truss R38 cavity R15 Sheath 20' Span","10-7A",2.98E-2]
[287,"St Truss R38 cavity R15 Sheath 22' Span","10-7A",2.9399999999999999E-2]
[288,"St Truss R38 cavity R15 Sheath 24' Span","10-7A",2.9100000000000001E-2]
[289,"St Truss R38 cavity R15 Sheath 26' Span","10-7A",2.8799999999999999E-2]
[290,"St Truss R38 cavity R15 Sheath 28' Span","10-7A",2.8500000000000001E-2]
[291,"St Truss R38 cavity R15 Sheath 30' Span","10-7A",2.8299999999999999E-2]
[292,"St Truss R38 cavity R15 Sheath 32' Span","10-7A",2.81E-2]
[293,"St Truss R38 cavity R15 Sheath 34' Span","10-7A",2.7900000000000001E-2]
[294,"St Truss R38 cavity R15 Sheath 36' Span","10-7A",2.7799999999999998E-2]
[295,"St Truss R49 cavity R15 Sheath 12' Span","10-7A",2.7400000000000001E-2]
[296,"St Truss R49 cavity R15 Sheath 14' Span","10-7A",2.63E-2]
[297,"St Truss R49 cavity R15 Sheath 16' Span","10-7A",2.5499999999999998E-2]
[298,"St Truss R49 cavity R15 Sheath 18' Span","10-7A",2.4899999999999999E-2]
[299,"St Truss R49 cavity R15 Sheath 20' Span","10-7A",2.4400000000000002E-2]
[300,"St Truss R49 cavity R15 Sheath 22' Span","10-7A",2.3900000000000001E-2]
[301,"St Truss R49 cavity R15 Sheath 24' Span","10-7A",2.3599999999999999E-2]
[302,"St Truss R49 cavity R15 Sheath 26' Span","10-7A",2.3300000000000001E-2]
[303,"St Truss R49 cavity R15 Sheath 28' Span","10-7A",2.3E-2]
[304,"St Truss R49 cavity R15 Sheath 30' Span","10-7A",2.2800000000000001E-2]
[305,"St Truss R49 cavity R15 Sheath 32' Span","10-7A",2.2599999999999999E-2]
[306,"St Truss R49 cavity R15 Sheath 34' Span","10-7A",2.2499999999999999E-2]
[307,"St Truss R49 cavity R15 Sheath 36' Span","10-7A",2.23E-2]
[308,"R19 batt Vault vented 2x10 16oc","10-7",4.9000000000000002E-2]
[309,"R19 batt Vault vented 2x10 24oc","10-7",4.8000000000000001E-2]
[310,"R30 batt Vault vented 2x12 16oc","10-7",3.4000000000000002E-2]
[311,"R30 batt Vault vented 2x12 24oc","10-7",3.3000000000000002E-2]
[312,"R38 batt Vault vented 2x14 16oc","10-7",2.7E-2]
[313,"R38 batt Vault vented 2x14 24oc","10-7",2.7E-2]
[314,"R49 batt Vault  24oc",null,0.02]
[315,"R60 batt Vault  24oc",null,1.7000000000000001E-2]
[316,"R30 batt Vault unvented 2x10 16oc","10-7",3.4000000000000002E-2]
[317,"R30 batt Vault unvented 2x10 24oc","10-7",3.3000000000000002E-2]
[318,"R38 batt Vault unvented 2x12 16oc","10-7",2.9000000000000001E-2]
[319,"R38 batt Vault unvented 2x12 24oc","10-7",2.7E-2]
[320,"R21+R21 Vault unvented 2x12 16oc","10-7",2.5999999999999999E-2]
[321,"R21+R21 Vault unvented 2x12 24oc","10-7",2.5000000000000001E-2]
[322,"R12.5 2\" Rigid Roof Deck 48oc","10-7",6.4000000000000001E-2]
[323,"R21.9 3.5\" Rigid Roof Deck 48oc","10-7",0.04]
[324,"R37.5 6\" Rigid Roof Deck 48oc","10-7",2.5000000000000001E-2]
[325,"R50 8\" Rigid Roof Deck 48oc","10-7",1.9E-2]
[326,"7.25\" flush frame stress skin","WSU",3.5999999999999997E-2]
[327,"7.25\" supported stress skin","WSU",3.3000000000000002E-2]
[328,"9.25\" flush frame stress skin","WSU",3.1E-2]
[329,"9.25\" supported stress skin","WSU",2.7E-2]
[330,"11.25\" flush frame stress skin","WSU",2.5000000000000001E-2]
[331,"11.25\" supported stress skin","WSU",2.1999999999999999E-2]
[332,"== Custom Entries per WSEC R402.1.5 U-factor Reference and Calculations ========  ",null,"U-value","Notes","Your entries appear at bottom of drowdown menus on \"Group R\" tab"]
[333,"Metal roof with External roof insulation; 4\" polyiso foam R25, Roof sheathing, truss, Rockwool R15, (Total R40) ","Custom",{"$f":"1/40","v":2.5000000000000001E-2},null,{"$f":"IF(AND(B341<>\"\",B340=\"\"),\"Don't skip lines\",IF(AND(D340=\"\",B340<>\"\"),\"Enter U-value\",IF(AND(D340<>\"\",B340=\"\"),\"Enter Description\",\"\")))","v":""}]
[334,"2x6 24\"oc R23 cavity + 4\" polyiso","Custom",2.0400000000000001E-2,null,""]
[335,null,"Custom",null,null,""]
[336,null,"Custom",null,null,""]
[{"$f":"A343+1","v":337},null,"Custom",null,null,""]
[338,null,"Custom",null,null,""]
[339,null,"Custom",null,null,""]
[340,null,"Custom",null,null,""]
[341,null,"Custom",null,null,""]
[342,null,"Custom",null,null,""]
[343,null,"Custom",null,null,""]
[344,null,"Custom",null,null,""]
[345,null,"Custom",null,null,""]
[346,null,"Custom",null,null,""]
[347,null,"Custom",null,null,""]
[348,null,"Custom",null,null,""]
[349,null,"Custom",null,null,""]
[350,null,"Custom",null,null,""]
[351,null,"Custom",null,null,""]
[352,null,"Custom",null,null,""]
[353,null,"Custom",null,null,""]
[354,null,"Custom",null,null,""]
[355,null,"Custom",null,null,""]
[356,null,"Custom",null,null,""]
[357,null,"Custom",null,null,""]
[358,null,"Custom",null,null,""]
[359,null,"Custom",null,null,""]
[360,null,"Custom",null,null,""]
[361,null,"Custom",null,null,""]
[362,null,"Custom",null,null,""]
[363,null,"Custom",null,null,""]
[364,null,"Custom",null,null,""]
[365,null,"Custom",null,null,""]
[366,null,"Custom",null,null,""]
[367,null,"Custom",null,null,""]
[368,null,"Custom",null,null,""]
[369,null,"Custom",null,null,""]
[370,null,"Custom",null,null,""]
[371,null,"Custom",null,null,""]
[372,null,"Custom",null,null,""]

{"sheet":"Walls(above grade)","index":10,"n_rows":989,"n_cols":6,"rows_kept":989,"cut":false,"hidden":true,"merged":[]}
["WSU Code Compliance Calculator  - WSEC 2015 &2018",null,null,null,null,"(C) 2020"]
["Above-Grade Walls Database"]
["Index","Component Description","Reference","Wall U"]
[]
[1]
[{"$f":"A5+1","v":2},"=== Most Frequently Used ========= "]
[{"$f":"A6+1","v":3},"R11 cavity+R0 foam STD 2X4W Lap","10-5",8.7999999999999995E-2]
[4,"R13 cavity+R10 foam STD 2X4W","10-5",4.4999999999999998E-2]
[5,"R19 cavity+R0 foam STD 2X6W Lap","10-5",6.2E-2]
[6,"R20 cavity+R5 foam STD 2X6W",null,4.4999999999999998E-2]
[7,"R21 cavity+R0 foam INT 2X6W Lap (Code Baseline)","10-5",5.3999999999999999E-2]
[8,"R21 cavity+R0 foam INT 2X6W T111 (Code Baseline)","10-5",5.6000000000000001E-2]
[9,"R21 cavity+R4 foam INT 2X6W Lap (2018 1.4)","10-5",4.2999999999999997E-2]
[10,"R21 cavity+R4 foam INT 2X6W T111 (2018 1.4)","10-5",4.4999999999999998E-2]
[11,"R21 cavity+R5 foam INT 2X6W Lap","10-5",4.1000000000000002E-2]
[12,"R21 cavity+R5 foam INT 2X6W T111","10-5",4.2000000000000003E-2]
[13,"R21 cavity+R12 foam INT 2X6W Lap (2021 1.3; 2018 1.5)","10-5",3.1E-2]
[{"$f":"A17+1","v":14},"R21 cavity+R12 foam INT 2X6W T111 (2021 1.3; 2018 1.5)","10-5",3.2000000000000001E-2]
[15,"R21 cavity+R16 foam INT 2X6W Lap (2021 1.4; 2018 1.6)","App A",2.7E-2]
[16,"R21 cavity+R16 foam INT 2X6W T111 (2021 1.4; 2018 1.6)","App A",2.8000000000000001E-2]
[17,"No above-grade walls in thermal envelope","NA",0]
[18,"2021 U-factor Baseline (Table R402.1.2)","Table R402.1.2",5.6000000000000001E-2]
[19,"============================","NA"]
[20,"R0 cavity+R0 foam STD 2X4W Lap","App A",0.31330000000000002]
[21,"R0 cavity+R0 foam STD 2X4W T111","App A",0.31769999999999998]
[22,"R11 cavity+R0 foam STD 2X4W Lap","10-5",8.7999999999999995E-2]
[23,"R11 cavity+R0 foam ADV 2X4W Lap","10-5",8.4000000000000005E-2]
[24,"R11 cavity+R0 foam STD 2X4W T111","10-5",9.4E-2]
[25,"R11 cavity+R0 foam ADV 2X4W T111","10-5",0.09]
[26,"R11 cavity+R1 foam STD 2X4W Lap","10-5",0.08]
[27,"R11 cavity+R1 foam ADV 2X4W Lap","10-5",0.77]
[28,"R11 cavity+R1 foam STD 2X4W T111","10-5",8.5000000000000006E-2]
[29,"R11 cavity+R1 foam ADV 2X4W T111","10-5",8.2000000000000003E-2]
[30,"R11 cavity+R2 foam STD 2X4W Lap","10-5",7.3999999999999996E-2]
[31,"R11 cavity+R2 foam ADV 2X4W Lap","10-5",7.0999999999999994E-2]
[32,"R11 cavity+R2 foam STD 2X4W T111","10-5",7.8E-2]
[33,"R11 cavity+R2 foam ADV 2X4W T111","10-5",7.4999999999999997E-2]
[34,"R11 cavity+R3 foam STD 2X4W Lap","10-5",6.9000000000000006E-2]
[35,"R11 cavity+R3 foam ADV 2X4W Lap","10-5",6.6000000000000003E-2]
[36,"R11 cavity+R3 foam STD 2X4W T111","10-5",7.1999999999999995E-2]
[37,"R11 cavity+R3 foam ADV 2X4W T111","10-5",7.0000000000000007E-2]
[38,"R11 cavity+R4 foam STD 2X4W Lap","10-5",6.4000000000000001E-2]
[39,"R11 cavity+R4 foam ADV 2X4W Lap","10-5",6.2E-2]
[40,"R11 cavity+R4 foam STD 2X4W T111","10-5",6.7000000000000004E-2]
[41,"R11 cavity+R4 foam ADV 2X4W T111","10-5",6.5000000000000002E-2]
[42,"R11 cavity+R5 foam STD 2X4W Lap","10-5",0.06]
[43,"R11 cavity+R5 foam ADV 2X4W Lap","10-5",5.8000000000000003E-2]
[44,"R11 cavity+R5 foam STD 2X4W T111","10-5",6.3E-2]
[45,"R11 cavity+R5 foam ADV 2X4W T111","10-5",6.0999999999999999E-2]
[46,"R11 cavity+R6 foam STD 2X4W Lap","10-5",5.6000000000000001E-2]
[47,"R11 cavity+R6 foam ADV 2X4W Lap","10-5",5.5E-2]
[48,"R11 cavity+R6 foam STD 2X4W T111","10-5",5.8999999999999997E-2]
[49,"R11 cavity+R6 foam ADV 2X4W T111","10-5",5.7000000000000002E-2]
[50,"R11 cavity+R7 foam STD 2X4W Lap","10-5",5.2999999999999999E-2]
[51,"R11 cavity+R7 foam ADV 2X4W Lap","10-5",5.1999999999999998E-2]
[52,"R11 cavity+R7 foam STD 2X4W T111","10-5",5.5E-2]
[53,"R11 cavity+R7 foam ADV 2X4W T111","10-5",5.3999999999999999E-2]
[54,"R11 cavity+R8 foam STD 2X4W Lap","10-5",5.0999999999999997E-2]
[55,"R11 cavity+R8 foam ADV 2X4W Lap","10-5",4.9000000000000002E-2]
[56,"R11 cavity+R8 foam STD 2X4W T111","10-5",5.1999999999999998E-2]
[57,"R11 cavity+R8 foam ADV 2X4W T111","10-5",5.0999999999999997E-2]
[58,"R11 cavity+R9 foam STD 2X4W Lap","10-5",4.8000000000000001E-2]
[59,"R11 cavity+R9 foam ADV 2X4W Lap","10-5",4.7E-2]
[60,"R11 cavity+R9 foam STD 2X4W T111","10-5",0.05]
[61,"R11 cavity+R9 foam ADV 2X4W T111","10-5",4.9000000000000002E-2]
[62,"R11 cavity+R10 foam STD 2X4W Lap","10-5",4.5999999999999999E-2]
[63,"R11 cavity+R10 foam ADV 2X4W Lap","10-5",4.4999999999999998E-2]
[64,"R11 cavity+R10 foam STD 2X4W T111","10-5",4.7E-2]
[65,"R11 cavity+R10 foam ADV 2X4W T111","10-5",4.5999999999999999E-2]
[66,"R11 cavity+R11 foam STD 2X4W Lap","10-5",4.3999999999999997E-2]
[67,"R11 cavity+R11 foam ADV 2X4W Lap","10-5",4.2999999999999997E-2]
[68,"R11 cavity+R11 foam STD 2X4W T111","10-5",4.4999999999999998E-2]
[69,"R11 cavity+R11 foam ADV 2X4W T111","10-5",4.3999999999999997E-2]
[70,"R11 cavity+R12 foam STD 2X4W Lap","10-5",4.2000000000000003E-2]
[71,"R11 cavity+R12 foam ADV 2X4W Lap","10-5",4.1000000000000002E-2]
[72,"R11 cavity+R12 foam STD 2X4W T111","10-5",4.2999999999999997E-2]
[73,"R11 cavity+R12 foam ADV 2X4W T111","10-5",4.2000000000000003E-2]
[74,"R13 cavity+R0 foam STD 2X4W Lap","10-5",8.2000000000000003E-2]
[{"$f":"A78+1","v":75},"R13 cavity+R0 foam ADV 2X4W Lap","10-5",7.8E-2]
[76,"R13 cavity+R0 foam STD 2X4W T111","10-5",8.7999999999999995E-2]
[77,"R13 cavity+R0 foam ADV 2X4W T111","10-5",8.3000000000000004E-2]
[78,"R13 cavity+R1 foam STD 2X4W Lap","10-5",7.4999999999999997E-2]
[79,"R13 cavity+R1 foam ADV 2X4W Lap","10-5",7.1999999999999995E-2]
[80,"R13 cavity+R1 foam STD 2X4W T111","10-5",0.08]
[81,"R13 cavity+R1 foam ADV 2X4W T111","10-5",7.5999999999999998E-2]
[82,"R13 cavity+R2 foam STD 2X4W Lap","10-5",6.9000000000000006E-2]
[83,"R13 cavity+R2 foam ADV 2X4W Lap","10-5",6.6000000000000003E-2]
[84,"R13 cavity+R2 foam STD 2X4W T111","10-5",7.2999999999999995E-2]
[85,"R13 cavity+R2 foam ADV 2X4W T111","10-5",7.0000000000000007E-2]
[86,"R13 cavity+R3 foam STD 2X4W Lap","10-5",6.5000000000000002E-2]
[87,"R13 cavity+R3 foam ADV 2X4W Lap","10-5",6.2E-2]
[88,"R13 cavity+R3 foam STD 2X4W T111","10-5",6.8000000000000005E-2]
[89,"R13 cavity+R3 foam ADV 2X4W T111","10-5",6.5000000000000002E-2]
[90,"R13 cavity+R4 foam STD 2X4W Lap","10-5",0.06]
[91,"R13 cavity+R4 foam ADV 2X4W Lap","10-5",5.8000000000000003E-2]
[92,"R13 cavity+R4 foam STD 2X4W T111","10-5",6.3E-2]
[93,"R13 cavity+R4 foam ADV 2X4W T111","10-5",6.0999999999999999E-2]
[94,"R13 cavity+R5 foam STD 2X4W Lap","10-5",5.7000000000000002E-2]
[95,"R13 cavity+R5 foam ADV 2X4W Lap","10-5",5.5E-2]
[96,"R13 cavity+R5 foam STD 2X4W T111","10-5",5.8999999999999997E-2]
[97,"R13 cavity+R5 foam ADV 2X4W T111","10-5",5.7000000000000002E-2]
[98,"R13 cavity+R6 foam STD 2X4W Lap","10-5",5.2999999999999999E-2]
[99,"R13 cavity+R6 foam ADV 2X4W Lap","10-5",5.1999999999999998E-2]
[100,"R13 cavity+R6 foam STD 2X4W T111","10-5",5.6000000000000001E-2]
[101,"R13 cavity+R6 foam ADV 2X4W T111","10-5",5.3999999999999999E-2]
[102,"R13 cavity+R7 foam STD 2X4W Lap","10-5",5.0999999999999997E-2]
[103,"R13 cavity+R7 foam ADV 2X4W Lap","10-5",4.9000000000000002E-2]
[104,"R13 cavity+R7 foam STD 2X4W T111","10-5",5.1999999999999998E-2]
[105,"R13 cavity+R7 foam ADV 2X4W T111","10-5",5.0999999999999997E-2]
[106,"R13 cavity+R8 foam STD 2X4W Lap","10-5",4.8000000000000001E-2]
[107,"R13 cavity+R8 foam ADV 2X4W Lap","10-5",4.7E-2]
[108,"R13 cavity+R8 foam STD 2X4W T111","10-5",0.05]
[109,"R13 cavity+R8 foam ADV 2X4W T111","10-5",4.8000000000000001E-2]
[110,"R13 cavity+R9 foam STD 2X4W Lap","10-5",4.5999999999999999E-2]
[111,"R13 cavity+R9 foam ADV 2X4W Lap","10-5",4.4999999999999998E-2]
[112,"R13 cavity+R9 foam STD 2X4W T111","10-5",4.7E-2]
[113,"R13 cavity+R9 foam ADV 2X4W T111","10-5",4.5999999999999999E-2]
[114,"R13 cavity+R10 foam STD 2X4W Lap","10-5",4.3999999999999997E-2]
[115,"R13 cavity+R10 foam ADV 2X4W Lap","10-5",4.2999999999999997E-2]
[116,"R13 cavity+R10 foam STD 2X4W T111","10-5",4.4999999999999998E-2]
[117,"R13 cavity+R10 foam ADV 2X4W T111","10-5",4.3999999999999997E-2]
[118,"R13 cavity+R11 foam STD 2X4W Lap","10-5",4.2000000000000003E-2]
[119,"R13 cavity+R11 foam ADV 2X4W Lap","10-5",4.1000000000000002E-2]
[120,"R13 cavity+R11 foam STD 2X4W T111","10-5",4.2999999999999997E-2]
[121,"R13 cavity+R11 foam ADV 2X4W T111","10-5",4.2000000000000003E-2]
[122,"R13 cavity+R12 foam STD 2X4W Lap","10-5",0.04]
[123,"R13 cavity+R12 foam ADV 2X4W Lap","10-5",3.9E-2]
[124,"R13 cavity+R12 foam STD 2X4W T111","10-5",4.1000000000000002E-2]
[125,"R13 cavity+R12 foam ADV 2X4W T111","10-5",0.04]
[126,"R15 cavity+R0 foam STD 2X4W Lap","10-5",7.5999999999999998E-2]
[127,"R15 cavity+R0 foam ADV 2X4W Lap","10-5",7.0999999999999994E-2]
[128,"R15 cavity+R0 foam STD 2X4W T111","10-5",8.1000000000000003E-2]
[129,"R15 cavity+R0 foam ADV 2X4W T111","10-5",7.4999999999999997E-2]
[130,"R15 cavity+R1 foam STD 2X4W Lap","10-5",6.9000000000000006E-2]
[131,"R15 cavity+R1 foam ADV 2X4W Lap","10-5",6.5000000000000002E-2]
[132,"R15 cavity+R1 foam STD 2X4W T111","10-5",7.2999999999999995E-2]
[133,"R15 cavity+R1 foam ADV 2X4W T111","10-5",6.9000000000000006E-2]
[134,"R15 cavity+R2 foam STD 2X4W Lap","10-5",6.4000000000000001E-2]
[135,"R15 cavity+R2 foam ADV 2X4W Lap","10-5",6.0999999999999999E-2]
[136,"R15 cavity+R2 foam STD 2X4W T111","10-5",6.8000000000000005E-2]
[137,"R15 cavity+R2 foam ADV 2X4W T111","10-5",6.9000000000000006E-2]
[138,"R15 cavity+R3 foam STD 2X4W Lap","10-5",0.06]
[{"$f":"A142+1","v":139},"R15 cavity+R3 foam ADV 2X4W Lap","10-5",5.7000000000000002E-2]
[140,"R15 cavity+R3 foam STD 2X4W T111","10-5",6.3E-2]
[141,"R15 cavity+R3 foam ADV 2X4W T111","10-5",5.8999999999999997E-2]
[142,"R15 cavity+R4 foam STD 2X4W Lap","10-5",5.6000000000000001E-2]
[143,"R15 cavity+R4 foam ADV 2X4W Lap","10-5",5.2999999999999999E-2]
[144,"R15 cavity+R4 foam STD 2X4W T111","10-5",5.8999999999999997E-2]
[145,"R15 cavity+R4 foam ADV 2X4W T111","10-5",5.6000000000000001E-2]
[146,"R15 cavity+R5 foam STD 2X4W Lap","10-5",5.2999999999999999E-2]
[147,"R15 cavity+R5 foam ADV 2X4W Lap","10-5",5.0999999999999997E-2]
[148,"R15 cavity+R5 foam STD 2X4W T111","10-5",5.5E-2]
[149,"R15 cavity+R5 foam ADV 2X4W T111","10-5",5.1999999999999998E-2]
[150,"R15 cavity+R6 foam STD 2X4W Lap","10-5",0.05]
[151,"R15 cavity+R6 foam ADV 2X4W Lap","10-5",4.8000000000000001E-2]
[152,"R15 cavity+R6 foam STD 2X4W T111","10-5",5.1999999999999998E-2]
[153,"R15 cavity+R6 foam ADV 2X4W T111","10-5",0.05]
[154,"R15 cavity+R7 foam STD 2X4W Lap","10-5",4.7E-2]
[155,"R15 cavity+R7 foam ADV 2X4W Lap","10-5",4.5999999999999999E-2]
[156,"R15 cavity+R7 foam STD 2X4W T111","10-5",4.9000000000000002E-2]
[157,"R15 cavity+R7 foam ADV 2X4W T111","10-5",4.7E-2]
[158,"R15 cavity+R8 foam STD 2X4W Lap","10-5",4.4999999999999998E-2]
[159,"R15 cavity+R8 foam ADV 2X4W Lap","10-5",4.3999999999999997E-2]
[160,"R15 cavity+R8 foam STD 2X4W T111","10-5",4.7E-2]
[161,"R15 cavity+R8 foam ADV 2X4W T111","10-5",4.4999999999999998E-2]
[162,"R15 cavity+R9 foam STD 2X4W Lap","10-5",4.2999999999999997E-2]
[163,"R15 cavity+R9 foam ADV 2X4W Lap","10-5",4.2000000000000003E-2]
[164,"R15 cavity+R9 foam STD 2X4W T111","10-5",4.3999999999999997E-2]
[165,"R15 cavity+R9 foam ADV 2X4W T111","10-5",4.2999999999999997E-2]
[166,"R15 cavity+R10 foam STD 2X4W Lap","10-5",4.1000000000000002E-2]
[167,"R15 cavity+R10 foam ADV 2X4W Lap","10-5",0.04]
[168,"R15 cavity+R10 foam STD 2X4W T111","10-5",4.2000000000000003E-2]
[169,"R15 cavity+R10 foam ADV 2X4W T111","10-5",4.1000000000000002E-2]
[170,"R15 cavity+R11 foam STD 2X4W Lap","10-5",3.9E-2]
[171,"R15 cavity+R11 foam ADV 2X4W Lap","10-5",3.7999999999999999E-2]
[172,"R15 cavity+R11 foam STD 2X4W T111","10-5",4.1000000000000002E-2]
[173,"R15 cavity+R11 foam ADV 2X4W T111","10-5",3.9E-2]
[174,"R15 cavity+R12 foam STD 2X4W Lap","10-5",3.7999999999999999E-2]
[175,"R15 cavity+R12 foam ADV 2X4W Lap","10-5",3.6999999999999998E-2]
[176,"R15 cavity+R12 foam STD 2X4W T111","10-5",3.9E-2]
[177,"R15 cavity+R12 foam ADV 2X4W T111","10-5",3.7999999999999999E-2]
[178,"R19 cavity+R0 foam STD 2X6W Lap","10-5",6.2E-2]
[179,"R19 cavity+R0 foam INT 2X6W Lap","10-5",5.8000000000000003E-2]
[180,"R19 cavity+R0 foam ADV 2X6W Lap","10-5",5.5E-2]
[181,"R19 cavity+R0 foam STD 2X6W T111","10-5",6.5000000000000002E-2]
[182,"R19 cavity+R0 foam INT 2X6W T111","10-5",6.0999999999999999E-2]
[183,"R19 cavity+R0 foam ADV 2X6W T111","10-5",5.8000000000000003E-2]
[184,"R19 cavity+R1 foam STD 2X6W Lap","10-5",5.8000000000000003E-2]
[185,"R19 cavity+R1 foam INT 2X6W Lap","10-5",5.5E-2]
[186,"R19 cavity+R1 foam ADV 2X6W Lap","10-5",5.1999999999999998E-2]
[187,"R19 cavity+R1 foam STD 2X6W T111","10-5",0.06]
[188,"R19 cavity+R1 foam INT 2X6W T111","10-5",5.7000000000000002E-2]
[189,"R19 cavity+R1 foam ADV 2X6W T111","10-5",5.5E-2]
[190,"R19 cavity+R2 foam STD 2X6W Lap","10-5",5.3999999999999999E-2]
[191,"R19 cavity+R2 foam INT 2X6W Lap","10-5",5.1999999999999998E-2]
[192,"R19 cavity+R2 foam ADV 2X6W Lap","10-5",0.05]
[193,"R19 cavity+R2 foam STD 2X6W T111","10-5",5.6000000000000001E-2]
[194,"R19 cavity+R2 foam INT 2X6W T111","10-5",5.3999999999999999E-2]
[195,"R19 cavity+R2 foam ADV 2X6W T111","10-5",5.0999999999999997E-2]
[196,"R19 cavity+R3 foam STD 2X6W Lap","10-5",5.0999999999999997E-2]
[197,"R19 cavity+R3 foam INT 2X6W Lap","10-5",4.9000000000000002E-2]
[198,"R19 cavity+R3 foam ADV 2X6W Lap","10-5",4.7E-2]
[199,"R19 cavity+R3 foam STD 2X6W T111","10-5",5.2999999999999999E-2]
[200,"R19 cavity+R3 foam INT 2X6W T111","10-5",5.0999999999999997E-2]
[201,"R19 cavity+R3 foam ADV 2X6W T111","10-5",4.9000000000000002E-2]
[202,"R19 cavity+R4 foam STD 2X6W Lap","10-5",4.8000000000000001E-2]
[{"$f":"A206+1","v":203},"R19 cavity+R4 foam INT 2X6W Lap","10-5",4.5999999999999999E-2]
[204,"R19 cavity+R4 foam ADV 2X6W Lap","10-5",4.4999999999999998E-2]
[205,"R19 cavity+R4 foam STD 2X6W T111","10-5",0.05]
[206,"R19 cavity+R4 foam INT 2X6W T111","10-5",4.8000000000000001E-2]
[207,"R19 cavity+R4 foam ADV 2X6W T111","10-5",4.5999999999999999E-2]
[208,"R19 cavity+R5 foam STD 2X6W Lap","10-5",4.5999999999999999E-2]
[209,"R19 cavity+R5 foam INT 2X6W Lap","10-5",4.3999999999999997E-2]
[210,"R19 cavity+R5 foam ADV 2X6W Lap","10-5",4.2999999999999997E-2]
[211,"R19 cavity+R5 foam STD 2X6W T111","10-5",4.8000000000000001E-2]
[212,"R19 cavity+R5 foam INT 2X6W T111","10-5",4.5999999999999999E-2]
[213,"R19 cavity+R5 foam ADV 2X6W T111","10-5",4.3999999999999997E-2]
[214,"R19 cavity+R6 foam STD 2X6W Lap","10-5",4.3999999999999997E-2]
[215,"R19 cavity+R6 foam INT 2X6W Lap","10-5",4.2000000000000003E-2]
[216,"R19 cavity+R6 foam ADV 2X6W Lap","10-5",4.1000000000000002E-2]
[217,"R19 cavity+R6 foam STD 2X6W T111","10-5",4.4999999999999998E-2]
[218,"R19 cavity+R6 foam INT 2X6W T111","10-5",4.3999999999999997E-2]
[219,"R19 cavity+R6 foam ADV 2X6W T111","10-5",4.2000000000000003E-2]
[220,"R19 cavity+R7 foam STD 2X6W Lap","10-5",4.2000000000000003E-2]
[221,"R19 cavity+R7 foam INT 2X6W Lap","10-5",0.04]
[222,"R19 cavity+R7 foam ADV 2X6W Lap","10-5",3.9E-2]
[223,"R19 cavity+R7 foam STD 2X6W T111","10-5",4.2999999999999997E-2]
[224,"R19 cavity+R7 foam INT 2X6W T111","10-5",4.2000000000000003E-2]
[225,"R19 cavity+R7 foam ADV 2X6W T111","10-5",0.04]
[226,"R19 cavity+R8 foam STD 2X6W Lap","10-5",0.04]
[227,"R19 cavity+R8 foam INT 2X6W Lap","10-5",3.9E-2]
[228,"R19 cavity+R8 foam ADV 2X6W Lap","10-5",3.7999999999999999E-2]
[229,"R19 cavity+R8 foam STD 2X6W T111","10-5",4.1000000000000002E-2]
[230,"R19 cavity+R8 foam INT 2X6W T111","10-5",0.04]
[231,"R19 cavity+R8 foam ADV 2X6W T111","10-5",3.9E-2]
[232,"R19 cavity+R9 foam STD 2X6W Lap","10-5",3.7999999999999999E-2]
[233,"R19 cavity+R9 foam INT 2X6W Lap","10-5",3.6999999999999998E-2]
[234,"R19 cavity+R9 foam ADV 2X6W Lap","10-5",3.5000000000000003E-2]
[235,"R19 cavity+R9 foam STD 2X6W T111","10-5",3.9E-2]
[236,"R19 cavity+R9 foam INT 2X6W T111","10-5",3.7999999999999999E-2]
[237,"R19 cavity+R9 foam ADV 2X6W T111","10-5",3.6999999999999998E-2]
[238,"R19 cavity+R10 foam STD 2X6W Lap","10-5",3.6999999999999998E-2]
[239,"R19 cavity+R10 foam INT 2X6W Lap","10-5",3.5999999999999997E-2]
[240,"R19 cavity+R10 foam ADV 2X6W Lap","10-5",3.5000000000000003E-2]
[241,"R19 cavity+R10 foam STD 2X6W T111","10-5",3.7999999999999999E-2]
[242,"R19 cavity+R10 foam INT 2X6W T111","10-5",3.6999999999999998E-2]
[243,"R19 cavity+R10 foam ADV 2X6W T111","10-5",3.5999999999999997E-2]
[244,"R19 cavity+R11 foam STD 2X6W Lap","10-5",3.5999999999999997E-2]
[245,"R19 cavity+R11 foam INT 2X6W Lap","10-5",3.5000000000000003E-2]
[246,"R19 cavity+R11 foam ADV 2X6W Lap","10-5",3.4000000000000002E-2]
[247,"R19 cavity+R11 foam STD 2X6W T111","10-5",3.5999999999999997E-2]
[248,"R19 cavity+R11 foam INT 2X6W T111","10-5",3.5000000000000003E-2]
[249,"R19 cavity+R11 foam ADV 2X6W T111","10-5",3.5000000000000003E-2]
[250,"R19 cavity+R12 foam STD 2X6W Lap","10-5",3.4000000000000002E-2]
[251,"R19 cavity+R12 foam INT 2X6W Lap","10-5",3.3000000000000002E-2]
[252,"R19 cavity+R12 foam ADV 2X6W Lap","10-5",3.3000000000000002E-2]
[253,"R19 cavity+R12 foam STD 2X6W T111","10-5",3.5000000000000003E-2]
[254,"R19 cavity+R12 foam INT 2X6W T111","10-5",3.4000000000000002E-2]
[255,"R19 cavity+R12 foam ADV 2X6W T111","10-5",3.3000000000000002E-2]
[256,"R20 cavity+R5 foam STD 2X6W",null,4.4999999999999998E-2]
[257,"R21 cavity+R0 foam STD 2X6W Lap","10-5",5.7000000000000002E-2]
[258,"R21 cavity+R0 foam INT 2X6W Lap","10-5",5.3999999999999999E-2]
[259,"R21 cavity+R0 foam ADV 2X6W Lap","10-5",5.0999999999999997E-2]
[260,"R21 cavity+R0 foam STD 2X6W T111","10-5",0.06]
[261,"R21 cavity+R0 foam INT 2X6W T111","10-5",5.6000000000000001E-2]
[262,"R21 cavity+R0 foam ADV 2X6W T111","10-5",5.2999999999999999E-2]
[263,"R21 cavity+R1 foam STD 2X6W Lap","10-5",5.3999999999999999E-2]
[264,"R21 cavity+R1 foam INT 2X6W Lap","10-5",5.0999999999999997E-2]
[265,"R21 cavity+R1 foam ADV 2X6W Lap","10-5",4.8000000000000001E-2]
[266,"R21 cavity+R1 foam STD 2X6W T111","10-5",5.6000000000000001E-2]
[267,"R21 cavity+R1 foam INT 2X6W T111","10-5",5.2999999999999999E-2]
[{"$f":"A271+1","v":268},"R21 cavity+R1 foam ADV 2X6W T111","10-5",0.05]
[269,"R21 cavity+R2 foam STD 2X6W Lap","10-5",0.05]
[270,"R21 cavity+R2 foam INT 2X6W Lap","10-5",4.8000000000000001E-2]
[271,"R21 cavity+R2 foam ADV 2X6W Lap","10-5",4.4999999999999998E-2]
[272,"R21 cavity+R2 foam STD 2X6W T111","10-5",5.1999999999999998E-2]
[273,"R21 cavity+R2 foam INT 2X6W T111","10-5",0.05]
[274,"R21 cavity+R2 foam ADV 2X6W T111","10-5",4.7E-2]
[275,"R21 cavity+R3 foam STD 2X6W Lap","10-5",4.8000000000000001E-2]
[276,"R21 cavity+R3 foam INT 2X6W Lap","10-5",4.4999999999999998E-2]
[277,"R21 cavity+R3 foam ADV 2X6W Lap","10-5",4.2999999999999997E-2]
[278,"R21 cavity+R3 foam STD 2X6W T111","10-5",4.9000000000000002E-2]
[279,"R21 cavity+R3 foam INT 2X6W T111","10-5",4.7E-2]
[280,"R21 cavity+R3 foam ADV 2X6W T111","10-5",4.4999999999999998E-2]
[281,"R21 cavity+R4 foam STD 2X6W Lap","10-5",4.4999999999999998E-2]
[282,"R21 cavity+R4 foam INT 2X6W Lap","10-5",4.2999999999999997E-2]
[283,"R21 cavity+R4 foam ADV 2X6W Lap","10-5",4.1000000000000002E-2]
[284,"R21 cavity+R4 foam STD 2X6W T111","10-5",4.7E-2]
[285,"R21 cavity+R4 foam INT 2X6W T111","10-5",4.4999999999999998E-2]
[286,"R21 cavity+R4 foam ADV 2X6W T111","10-5",4.2999999999999997E-2]
[287,"R21 cavity+R5 foam STD 2X6W Lap","10-5",4.2999999999999997E-2]
[288,"R21 cavity+R5 foam INT 2X6W Lap","10-5",4.1000000000000002E-2]
[289,"R21 cavity+R5 foam ADV 2X6W Lap","10-5",0.04]
[290,"R21 cavity+R5 foam STD 2X6W T111","10-5",4.3999999999999997E-2]
[291,"R21 cavity+R5 foam INT 2X6W T111","10-5",4.2000000000000003E-2]
[292,"R21 cavity+R5 foam ADV 2X6W T111","10-5",4.1000000000000002E-2]
[293,"R21 cavity+R6 foam STD 2X6W Lap","10-5",4.1000000000000002E-2]
[294,"R21 cavity+R6 foam INT 2X6W Lap","10-5",3.9E-2]
[295,"R21 cavity+R6 foam ADV 2X6W Lap","10-5",3.7999999999999999E-2]
[296,"R21 cavity+R6 foam STD 2X6W T111","10-5",4.2000000000000003E-2]
[297,"R21 cavity+R6 foam INT 2X6W T111","10-5",4.1000000000000002E-2]
[298,"R21 cavity+R6 foam ADV 2X6W T111","10-5",3.9E-2]
[299,"R21 cavity+R7 foam STD 2X6W Lap","10-5",3.9E-2]
[300,"R21 cavity+R7 foam INT 2X6W Lap","10-5",3.7999999999999999E-2]
[301,"R21 cavity+R7 foam ADV 2X6W Lap","10-5",3.5999999999999997E-2]
[302,"R21 cavity+R7 foam STD 2X6W T111","10-5",0.04]
[303,"R21 cavity+R7 foam INT 2X6W T111","10-5",3.9E-2]
[304,"R21 cavity+R7 foam ADV 2X6W T111","10-5",3.6999999999999998E-2]
[305,"R21 cavity+R8 foam STD 2X6W Lap","10-5",3.7999999999999999E-2]
[306,"R21 cavity+R8 foam INT 2X6W Lap","10-5",3.5999999999999997E-2]
[307,"R21 cavity+R8 foam ADV 2X6W Lap","10-5",3.5000000000000003E-2]
[308,"R21 cavity+R8 foam STD 2X6W T111","10-5",3.9E-2]
[309,"R21 cavity+R8 foam INT 2X6W T111","10-5",3.6999999999999998E-2]
[310,"R21 cavity+R8 foam ADV 2X6W T111","10-5",3.5999999999999997E-2]
[311,"R21 cavity+R9 foam STD 2X6W Lap","10-5",3.5999999999999997E-2]
[312,"R21 cavity+R9 foam INT 2X6W Lap","10-5",3.5000000000000003E-2]
[313,"R21 cavity+R9 foam ADV 2X6W Lap","10-5",3.4000000000000002E-2]
[314,"R21 cavity+R9 foam STD 2X6W T111","10-5",3.6999999999999998E-2]
[315,"R21 cavity+R9 foam INT 2X6W T111","10-5",3.5999999999999997E-2]
[316,"R21 cavity+R9 foam ADV 2X6W T111","10-5",3.5000000000000003E-2]
[317,"R21 cavity+R10 foam STD 2X6W Lap","10-5",3.5000000000000003E-2]
[318,"R21 cavity+R10 foam INT 2X6W Lap","10-5",3.4000000000000002E-2]
[319,"R21 cavity+R10 foam ADV 2X6W Lap","10-5",3.3000000000000002E-2]
[320,"R21 cavity+R10 foam STD 2X6W T111","10-5",3.5999999999999997E-2]
[321,"R21 cavity+R10 foam INT 2X6W T111","10-5",3.5000000000000003E-2]
[322,"R21 cavity+R10 foam ADV 2X6W T111","10-5",3.3000000000000002E-2]
[323,"R21 cavity+R11 foam STD 2X6W Lap","10-5",3.3000000000000002E-2]
[324,"R21 cavity+R11 foam INT 2X6W Lap","10-5",3.3000000000000002E-2]
[325,"R21 cavity+R11 foam ADV 2X6W Lap","10-5",3.2000000000000001E-2]
[326,"R21 cavity+R11 foam STD 2X6W T111","10-5",3.4000000000000002E-2]
[327,"R21 cavity+R11 foam INT 2X6W T111","10-5",3.3000000000000002E-2]
[328,"R21 cavity+R11 foam ADV 2X6W T111","10-5",3.2000000000000001E-2]
[329,"R21 cavity+R12 foam STD 2X6W Lap","10-5",3.2000000000000001E-2]
[330,"R21 cavity+R12 foam INT 2X6W Lap","10-5",3.1E-2]
[331,"R21 cavity+R12 foam ADV 2X6W Lap","10-5",3.1E-2]
[{"$f":"A335+1","v":332},"R21 cavity+R12 foam STD 2X6W T111","10-5",3.3000000000000002E-2]
[333,"R21 cavity+R12 foam INT 2X6W T111","10-5",3.2000000000000001E-2]
[334,"R21 cavity+R12 foam ADV 2X6W T111","10-5",3.1E-2]
[335,"R21 cavity+R16 foam INT 2X6W Lap","App A",2.7E-2]
[336,"R21 cavity+R16 foam INT 2X6W T111","App A",2.8000000000000001E-2]
[337,"R22 cavity+R0 foam STD 2X6W Lap","10-5",5.8999999999999997E-2]
[338,"R22 cavity+R0 foam INT 2X6W Lap","10-5",5.5E-2]
[339,"R22 cavity+R0 foam ADV 2X6W Lap","10-5",5.1999999999999998E-2]
[340,"R22 cavity+R0 foam STD 2X6W T111","10-5",6.2E-2]
[341,"R22 cavity+R0 foam INT 2X6W T111","10-5",5.8000000000000003E-2]
[342,"R22 cavity+R0 foam ADV 2X6W T111","10-5",5.3999999999999999E-2]
[343,"R22 cavity+R1 foam STD 2X6W Lap","10-5",5.5E-2]
[344,"R22 cavity+R1 foam INT 2X6W Lap","10-5",5.1999999999999998E-2]
[345,"R22 cavity+R1 foam ADV 2X6W Lap","10-5",4.9000000000000002E-2]
[346,"R22 cavity+R1 foam STD 2X6W T111","10-5",5.7000000000000002E-2]
[347,"R22 cavity+R1 foam INT 2X6W T111","10-5",5.3999999999999999E-2]
[348,"R22 cavity+R1 foam ADV 2X6W T111","10-5",5.0999999999999997E-2]
[349,"R22 cavity+R2 foam STD 2X6W Lap","10-5",5.1999999999999998E-2]
[350,"R22 cavity+R2 foam INT 2X6W Lap","10-5",4.9000000000000002E-2]
[351,"R22 cavity+R2 foam ADV 2X6W Lap","10-5",4.7E-2]
[352,"R22 cavity+R2 foam STD 2X6W T111","10-5",5.3999999999999999E-2]
[353,"R22 cavity+R2 foam INT 2X6W T111","10-5",5.0999999999999997E-2]
[354,"R22 cavity+R2 foam ADV 2X6W T111","10-5",4.8000000000000001E-2]
[355,"R22 cavity+R3 foam STD 2X6W Lap","10-5",4.9000000000000002E-2]
[356,"R22 cavity+R3 foam INT 2X6W Lap","10-5",4.5999999999999999E-2]
[357,"R22 cavity+R3 foam ADV 2X6W Lap","10-5",4.3999999999999997E-2]
[358,"R22 cavity+R3 foam STD 2X6W T111","10-5",0.05]
[359,"R22 cavity+R3 foam INT 2X6W T111","10-5",4.8000000000000001E-2]
[360,"R22 cavity+R3 foam ADV 2X6W T111","10-5",4.5999999999999999E-2]
[361,"R22 cavity+R4 foam STD 2X6W Lap","10-5",4.5999999999999999E-2]
[362,"R22 cavity+R4 foam INT 2X6W Lap","10-5",4.3999999999999997E-2]
[363,"R22 cavity+R4 foam ADV 2X6W Lap","10-5",4.2000000000000003E-2]
[364,"R22 cavity+R4 foam STD 2X6W T111","10-5",4.8000000000000001E-2]
[365,"R22 cavity+R4 foam INT 2X6W T111","10-5",4.5999999999999999E-2]
[366,"R22 cavity+R4 foam ADV 2X6W T111","10-5",4.3999999999999997E-2]
[367,"R22 cavity+R5 foam STD 2X6W Lap","10-5",4.3999999999999997E-2]
[368,"R22 cavity+R5 foam INT 2X6W Lap","10-5",4.2000000000000003E-2]
[369,"R22 cavity+R5 foam ADV 2X6W Lap","10-5",4.1000000000000002E-2]
[370,"R22 cavity+R5 foam STD 2X6W T111","10-5",4.4999999999999998E-2]
[371,"R22 cavity+R5 foam INT 2X6W T111","10-5",4.2999999999999997E-2]
[372,"R22 cavity+R5 foam ADV 2X6W T111","10-5",4.2000000000000003E-2]
[373,"R22 cavity+R6 foam STD 2X6W Lap","10-5",4.2000000000000003E-2]
[374,"R22 cavity+R6 foam INT 2X6W Lap","10-5",0.04]
[375,"R22 cavity+R6 foam ADV 2X6W Lap","10-5",3.9E-2]
[376,"R22 cavity+R6 foam STD 2X6W T111","10-5",4.2999999999999997E-2]
[377,"R22 cavity+R6 foam INT 2X6W T111","10-5",4.2000000000000003E-2]
[378,"R22 cavity+R6 foam ADV 2X6W T111","10-5",0.04]
[379,"R22 cavity+R7 foam STD 2X6W Lap","10-5",0.04]
[380,"R22 cavity+R7 foam INT 2X6W Lap","10-5",3.9E-2]
[381,"R22 cavity+R7 foam ADV 2X6W Lap","10-5",3.6999999999999998E-2]
[382,"R22 cavity+R7 foam STD 2X6W T111","10-5",4.1000000000000002E-2]
[383,"R22 cavity+R7 foam INT 2X6W T111","10-5",3.7999999999999999E-2]
[384,"R22 cavity+R7 foam ADV 2X6W T111","10-5",0.04]
[385,"R22 cavity+R8 foam STD 2X6W Lap","10-5",3.7999999999999999E-2]
[386,"R22 cavity+R8 foam INT 2X6W Lap","10-5",3.6999999999999998E-2]
[387,"R22 cavity+R8 foam ADV 2X6W Lap","10-5",3.5999999999999997E-2]
[388,"R22 cavity+R8 foam STD 2X6W T111","10-5",3.9E-2]
[389,"R22 cavity+R8 foam INT 2X6W T111","10-5",3.7999999999999999E-2]
[390,"R22 cavity+R8 foam ADV 2X6W T111","10-5",3.6999999999999998E-2]
[391,"R22 cavity+R9 foam STD 2X6W Lap","10-5",3.6999999999999998E-2]
[392,"R22 cavity+R9 foam INT 2X6W Lap","10-5",3.5999999999999997E-2]
[393,"R22 cavity+R9 foam ADV 2X6W Lap","10-5",3.5000000000000003E-2]
[394,"R22 cavity+R9 foam STD 2X6W T111","10-5",3.7999999999999999E-2]
[395,"R22 cavity+R9 foam INT 2X6W T111","10-5",3.6999999999999998E-2]
[396,"R22 cavity+R9 foam ADV 2X6W T111","10-5",3.5000000000000003E-2]
[397,"R22 cavity+R10 foam STD 2X6W Lap","10-5",3.5000000000000003E-2]
[{"$f":"A401+1","v":398},"R22 cavity+R10 foam INT 2X6W Lap","10-5",3.4000000000000002E-2]
[399,"R22 cavity+R10 foam ADV 2X6W Lap","10-5",3.3000000000000002E-2]
[400,"R22 cavity+R10 foam STD 2X6W T111","10-5",3.5999999999999997E-2]
[401,"R22 cavity+R10 foam INT 2X6W T111","10-5",3.5000000000000003E-2]
[402,"R22 cavity+R10 foam ADV 2X6W T111","10-5",3.4000000000000002E-2]
[403,"R22 cavity+R11 foam STD 2X6W Lap","10-5",3.4000000000000002E-2]
[404,"R22 cavity+R11 foam INT 2X6W Lap","10-5",3.3000000000000002E-2]
[405,"R22 cavity+R11 foam ADV 2X6W Lap","10-5",3.2000000000000001E-2]
[406,"R22 cavity+R11 foam STD 2X6W T111","10-5",3.5000000000000003E-2]
[407,"R22 cavity+R11 foam INT 2X6W T111","10-5",3.4000000000000002E-2]
[408,"R22 cavity+R11 foam ADV 2X6W T111","10-5",3.3000000000000002E-2]
[409,"R22 cavity+R12 foam STD 2X6W Lap","10-5",3.3000000000000002E-2]
[410,"R22 cavity+R12 foam INT 2X6W Lap","10-5",3.2000000000000001E-2]
[411,"R22 cavity+R12 foam ADV 2X6W Lap","10-5",3.1E-2]
[412,"R22 cavity+R12 foam STD 2X6W T111","10-5",3.4000000000000002E-2]
[413,"R22 cavity+R12 foam INT 2X6W T111","10-5",3.3000000000000002E-2]
[414,"R22 cavity+R12 foam ADV 2X6W T111","10-5",3.2000000000000001E-2]
[415,"R22 cavity+R12 foam ADV 2X6W T111","10-5",3.2000000000000001E-2]
[416,"R23 cavity+R0 foam INT 2X6W Lap","App A",4.9000000000000002E-2,"Added Dec 2021"]
[417,"R23 cavity+R0 foam INT 2X6W T111","App A",0.05,"Added Dec 2021"]
[418,"R23 cavity+R1 foam INT 2X6W Lap","App A",4.7E-2,"Added Dec 2021"]
[419,"R23 cavity+R1 foam INT 2X6W T111","App A",4.7E-2,"Added Dec 2021"]
[420,"R23 cavity+R2 foam INT 2X6W Lap","App A",4.3999999999999997E-2,"Added Dec 2021"]
[421,"R23 cavity+R2 foam INT 2X6W T111","App A",4.3999999999999997E-2,"Added Dec 2021"]
[422,"R23 cavity+R3 foam INT 2X6W Lap","App A",4.2000000000000003E-2,"Added Dec 2021"]
[423,"R23 cavity+R3 foam INT 2X6W T111","App A",4.2000000000000003E-2,"Added Dec 2021"]
[424,"R23 cavity+R4 foam INT 2X6W Lap","App A",0.04,"Added Dec 2021"]
[425,"R23 cavity+R4 foam INT 2X6W T111","App A",0.04,"Added Dec 2021"]
[426,"R23 cavity+R5 foam INT 2X6W Lap","App A",3.7999999999999999E-2,"Added May 2021, Corr Dec 2021"]
[427,"R23 cavity+R5 foam INT 2X6W T111","App A",3.9E-2,"Added May 2021, Corr Dec 2021"]
[428,"R23 cavity+R5 foam ADV 2X6W Lap","App A",3.7999999999999999E-2,"Added May 2021, Corr Dec 2021"]
[429,"R23 cavity+R5 foam ADV 2X6W T111","App A",3.7999999999999999E-2,"Added May 2021, Corr Dec 2021"]
[430,"R24 cavity+R5 foam INT 2X6W Lap","App A",3.7999999999999999E-2,"Added May 2021, Corr Dec 2021"]
[431,"R24 cavity+R5 foam INT 2X6W T111","App A",3.7999999999999999E-2,"Added May 2021, Corr Dec 2021"]
[432,"R24 cavity+R5 foam ADV 2X6W Lap","App A",3.6999999999999998E-2,"Added May 2021, Corr Dec 2021"]
[433,"R24 cavity+R5 foam ADV 2X6W T111","App A",3.6999999999999998E-2,"Added May 2021, Corr Dec 2021"]
[434,"R11+11 cavity+R0 foam STD 2X6W Lap","10-5",0.06]
[435,"R11+11 cavity+R0 foam INT 2X6W Lap","10-5",5.7000000000000002E-2]
[436,"R11+11 cavity+R0 foam ADV 2X6W Lap","10-5",5.3999999999999999E-2]
[437,"R11+11 cavity+R0 foam STD 2X6W T111","10-5",6.3E-2]
[438,"R11+11 cavity+R0 foam INT 2X6W T111","10-5",5.8999999999999997E-2]
[439,"R11+11 cavity+R0 foam ADV 2X6W T111","10-5",5.6000000000000001E-2]
[440,"R11+11 cavity+R1 foam STD 2X6W Lap","10-5",5.6000000000000001E-2]
[441,"R11+11 cavity+R1 foam INT 2X6W Lap","10-5",5.2999999999999999E-2]
[442,"R11+11 cavity+R1 foam ADV 2X6W Lap","10-5",5.0999999999999997E-2]
[443,"R11+11 cavity+R1 foam STD 2X6W T111","10-5",5.8999999999999997E-2]
[444,"R11+11 cavity+R1 foam INT 2X6W T111","10-5",5.6000000000000001E-2]
[445,"R11+11 cavity+R1 foam ADV 2X6W T111","10-5",5.2999999999999999E-2]
[446,"R11+11 cavity+R2 foam STD 2X6W Lap","10-5",5.2999999999999999E-2]
[447,"R11+11 cavity+R2 foam INT 2X6W Lap","10-5",0.05]
[448,"R11+11 cavity+R2 foam ADV 2X6W Lap","10-5",4.8000000000000001E-2]
[449,"R11+11 cavity+R2 foam STD 2X6W T111","10-5",5.5E-2]
[450,"R11+11 cavity+R2 foam INT 2X6W T111","10-5",5.1999999999999998E-2]
[451,"R11+11 cavity+R2 foam ADV 2X6W T111","10-5",0.05]
[452,"R11+11 cavity+R3 foam STD 2X6W Lap","10-5",0.05]
[453,"R11+11 cavity+R3 foam INT 2X6W Lap","10-5",4.8000000000000001E-2]
[454,"R11+11 cavity+R3 foam ADV 2X6W Lap","10-5",4.5999999999999999E-2]
[455,"R11+11 cavity+R3 foam STD 2X6W T111","10-5",5.1999999999999998E-2]
[456,"R11+11 cavity+R3 foam INT 2X6W T111","10-5",4.9000000000000002E-2]
[457,"R11+11 cavity+R3 foam ADV 2X6W T111","10-5",4.7E-2]
[458,"R11+11 cavity+R4 foam STD 2X6W Lap","10-5",4.7E-2]
[459,"R11+11 cavity+R4 foam INT 2X6W Lap","10-5",4.4999999999999998E-2]
[460,"R11+11 cavity+R4 foam ADV 2X6W Lap","10-5",4.3999999999999997E-2]
[461,"R11+11 cavity+R4 foam STD 2X6W T111","10-5",4.9000000000000002E-2]
[462,"R11+11 cavity+R4 foam INT 2X6W T111","10-5",4.7E-2]
[463,"R11+11 cavity+R4 foam ADV 2X6W T111","10-5",4.4999999999999998E-2]
[464,"R11+11 cavity+R5 foam STD 2X6W Lap","10-5",4.4999999999999998E-2]
[465,"R11+11 cavity+R5 foam INT 2X6W Lap","10-5",4.2999999999999997E-2]
[466,"R11+11 cavity+R5 foam ADV 2X6W Lap","10-5",4.2000000000000003E-2]
[467,"R11+11 cavity+R5 foam STD 2X6W T111","10-5",4.5999999999999999E-2]
[468,"R11+11 cavity+R5 foam INT 2X6W T111","10-5",4.4999999999999998E-2]
[469,"R11+11 cavity+R5 foam ADV 2X6W T111","10-5",4.2999999999999997E-2]
[470,"R11+11 cavity+R6 foam STD 2X6W Lap","10-5",4.2999999999999997E-2]
[471,"R11+11 cavity+R6 foam INT 2X6W Lap","10-5",4.1000000000000002E-2]
[472,"R11+11 cavity+R6 foam ADV 2X6W Lap","10-5",0.04]
[473,"R11+11 cavity+R6 foam STD 2X6W T111","10-5",4.3999999999999997E-2]
[474,"R11+11 cavity+R6 foam INT 2X6W T111","10-5",4.2999999999999997E-2]
[475,"R11+11 cavity+R6 foam ADV 2X6W T111","10-5",4.1000000000000002E-2]
[476,"R11+11 cavity+R7 foam STD 2X6W Lap","10-5",4.1000000000000002E-2]
[477,"R11+11 cavity+R7 foam INT 2X6W Lap","10-5",0.04]
[478,"R11+11 cavity+R7 foam ADV 2X6W Lap","10-5",3.7999999999999999E-2]
[479,"R11+11 cavity+R7 foam STD 2X6W T111","10-5",4.2000000000000003E-2]
[480,"R11+11 cavity+R7 foam INT 2X6W T111","10-5",4.1000000000000002E-2]
[{"$f":"A484+1","v":481},"R11+11 cavity+R7 foam ADV 2X6W T111","10-5",3.9E-2]
[482,"R11+11 cavity+R8 foam STD 2X6W Lap","10-5",3.9E-2]
[483,"R11+11 cavity+R8 foam INT 2X6W Lap","10-5",3.7999999999999999E-2]
[484,"R11+11 cavity+R8 foam ADV 2X6W Lap","10-5",3.6999999999999998E-2]
[485,"R11+11 cavity+R8 foam STD 2X6W T111","10-5",0.04]
[486,"R11+11 cavity+R8 foam INT 2X6W T111","10-5",3.9E-2]
[487,"R11+11 cavity+R8 foam ADV 2X6W T111","10-5",3.7999999999999999E-2]
[488,"R11+11 cavity+R9 foam STD 2X6W Lap","10-5",3.7999999999999999E-2]
[489,"R11+11 cavity+R9 foam INT 2X6W Lap","10-5",3.6999999999999998E-2]
[490,"R11+11 cavity+R9 foam ADV 2X6W Lap","10-5",3.5999999999999997E-2]
[491,"R11+11 cavity+R9 foam STD 2X6W T111","10-5",3.9E-2]
[492,"R11+11 cavity+R9 foam INT 2X6W T111","10-5",3.7999999999999999E-2]
[493,"R11+11 cavity+R9 foam ADV 2X6W T111","10-5",3.5999999999999997E-2]
[494,"R11+11 cavity+R10 foam STD 2X6W Lap","10-5",3.5999999999999997E-2]
[495,"R11+11 cavity+R10 foam INT 2X6W Lap","10-5",3.5000000000000003E-2]
[496,"R11+11 cavity+R10 foam ADV 2X6W Lap","10-5",3.4000000000000002E-2]
[497,"R11+11 cavity+R10 foam STD 2X6WT111","10-5",3.6999999999999998E-2]
[498,"R11+11 cavity+R10 foam INT 2X6W T111","10-5",3.5999999999999997E-2]
[499,"R11+11 cavity+R10 foam ADV 2X6WT111","10-5",3.5000000000000003E-2]
[500,"R11+11 cavity+R11 foam STD 2X6W Lap","10-5",3.5000000000000003E-2]
[501,"R11+11 cavity+R11 foam INT 2X6W Lap","10-5",3.4000000000000002E-2]
[502,"R11+11 cavity+R11 foam ADV 2X6W Lap","10-5",3.3000000000000002E-2]
[503,"R11+11 cavity+R11 foam STD 2X6WT111","10-5",3.5999999999999997E-2]
[504,"R11+11 cavity+R11 foam INT 2X6W T111","10-5",3.5000000000000003E-2]
[505,"R11+11 cavity+R11 foam ADV 2X6WT111","10-5",3.4000000000000002E-2]
[506,"R11+11 cavity+R12 foam STD 2X6W Lap","10-5",3.4000000000000002E-2]
[507,"R11+11 cavity+R12 foam INT 2X6W Lap","10-5",3.3000000000000002E-2]
[508,"R11+11 cavity+R12 foam ADV 2X6W Lap","10-5",3.2000000000000001E-2]
[509,"R11+11 cavity+R12 foam STD 2X6WT111","10-5",3.4000000000000002E-2]
[510,"R11+11 cavity+R12 foam INT 2X6W T111","10-5",3.4000000000000002E-2]
[511,"R11+11 cavity+R12 foam ADV 2X6WT111","10-5",3.3000000000000002E-2]
[512,"R25 cavity+R0 foam STD 2X8W Lap","10-5",5.0999999999999997E-2]
[513,"R25 cavity+R0 foam INT 2X8W Lap","10-5",4.7E-2]
[514,"R25 cavity+R0 foam ADV 2X8W Lap","10-5",4.4999999999999998E-2]
[515,"R25 cavity+R0 foam STD 2X8W T111","10-5",5.2999999999999999E-2]
[516,"R25 cavity+R0 foam INT 2X8W T111","10-5",4.9000000000000002E-2]
[517,"R25 cavity+R0 foam ADV 2X8W T111","10-5",4.5999999999999999E-2]
[518,"R25 cavity+R1 foam STD 2X8W Lap","10-5",4.8000000000000001E-2]
[519,"R25 cavity+R1 foam INT 2X8W Lap","10-5",4.4999999999999998E-2]
[520,"R25 cavity+R1 foam ADV 2X8W Lap","10-5",4.2999999999999997E-2]
[521,"R25 cavity+R1 foam STD 2X8W T111","10-5",4.9000000000000002E-2]
[522,"R25 cavity+R1 foam INT 2X8W T111","10-5",4.5999999999999999E-2]
[523,"R25 cavity+R1 foam ADV 2X8W T111","10-5",4.3999999999999997E-2]
[524,"R25 cavity+R2 foam STD 2X8W Lap","10-5",4.4999999999999998E-2]
[525,"R25 cavity+R2 foam INT 2X8W Lap","10-5",4.2999999999999997E-2]
[526,"R25 cavity+R2 foam ADV 2X8W Lap","10-5",4.1000000000000002E-2]
[527,"R25 cavity+R2 foam STD 2X8W T111","10-5",4.7E-2]
[528,"R25 cavity+R2 foam INT 2X8W T111","10-5",4.3999999999999997E-2]
[529,"R25 cavity+R2 foam ADV 2X8W T111","10-5",4.2000000000000003E-2]
[530,"R25 cavity+R3 foam STD 2X8W Lap","10-5",4.2999999999999997E-2]
[531,"R25 cavity+R3 foam INT 2X8W Lap","10-5",4.1000000000000002E-2]
[532,"R25 cavity+R3 foam ADV 2X8W Lap","10-5",3.9E-2]
[533,"R25 cavity+R3 foam STD 2X8W T111","10-5",4.3999999999999997E-2]
[534,"R25 cavity+R3 foam INT 2X8W T111","10-5",4.2000000000000003E-2]
[535,"R25 cavity+R3 foam ADV 2X8W T111","10-5",0.04]
[536,"R25 cavity+R4 foam STD 2X8W Lap","10-5",4.1000000000000002E-2]
[537,"R25 cavity+R4 foam INT 2X8W Lap","10-5",3.9E-2]
[538,"R25 cavity+R4 foam ADV 2X8W Lap","10-5",3.6999999999999998E-2]
[539,"R25 cavity+R4 foam STD 2X8W T111","10-5",4.2000000000000003E-2]
[540,"R25 cavity+R4 foam INT 2X8W T111","10-5",0.04]
[541,"R25 cavity+R4 foam ADV 2X8W T111","10-5",3.7999999999999999E-2]
[542,"R25 cavity+R5 foam STD 2X8W Lap","10-5",3.9E-2]
[543,"R25 cavity+R5 foam INT 2X8W Lap","10-5",3.6999999999999998E-2]
[544,"R25 cavity+R5 foam ADV 2X8W Lap","10-5",3.5999999999999997E-2]
[{"$f":"A548+1","v":545},"R25 cavity+R5 foam STD 2X8W T111","10-5",0.04]
[546,"R25 cavity+R5 foam INT 2X8W T111","10-5",3.7999999999999999E-2]
[547,"R25 cavity+R5 foam ADV 2X8W T111","10-5",3.6999999999999998E-2]
[548,"R25 cavity+R6 foam STD 2X8W Lap","10-5",3.6999999999999998E-2]
[549,"R25 cavity+R6 foam INT 2X8W Lap","10-5",3.5999999999999997E-2]
[550,"R25 cavity+R6 foam ADV 2X8W Lap","10-5",3.5000000000000003E-2]
[551,"R25 cavity+R6 foam STD 2X8W T111","10-5",3.7999999999999999E-2]
[552,"R25 cavity+R6 foam INT 2X8W T111","10-5",3.6999999999999998E-2]
[553,"R25 cavity+R6 foam ADV 2X8W T111","10-5",3.5999999999999997E-2]
[554,"R25 cavity+R7 foam STD 2X8W Lap","10-5",3.5999999999999997E-2]
[555,"R25 cavity+R7 foam INT 2X8W Lap","10-5",3.5000000000000003E-2]
[556,"R25 cavity+R7 foam ADV 2X8W Lap","10-5",3.3000000000000002E-2]
[557,"R25 cavity+R7 foam STD 2X8W T111","10-5",3.6999999999999998E-2]
[558,"R25 cavity+R7 foam INT 2X8W T111","10-5",3.5000000000000003E-2]
[559,"R25 cavity+R7 foam ADV 2X8W T111","10-5",3.4000000000000002E-2]
[560,"R25 cavity+R8 foam STD 2X8W Lap","10-5",3.5000000000000003E-2]
[561,"R25 cavity+R8 foam INT 2X8W Lap","10-5",3.3000000000000002E-2]
[562,"R25 cavity+R8 foam ADV 2X8W Lap","10-5",3.2000000000000001E-2]
[563,"R25 cavity+R8 foam STD 2X8W T111","10-5",3.5000000000000003E-2]
[564,"R25 cavity+R8 foam INT 2X8W T111","10-5",3.4000000000000002E-2]
[565,"R25 cavity+R8 foam ADV 2X8W T111","10-5",3.3000000000000002E-2]
[566,"R25 cavity+R9 foam STD 2X8W Lap","10-5",3.3000000000000002E-2]
[567,"R25 cavity+R9 foam INT 2X8W Lap","10-5",3.2000000000000001E-2]
[568,"R25 cavity+R9 foam ADV 2X8W Lap","10-5",3.1E-2]
[569,"R25 cavity+R9 foam STD 2X8W T111","10-5",3.4000000000000002E-2]
[570,"R25 cavity+R9 foam INT 2X8W T111","10-5",3.3000000000000002E-2]
[571,"R25 cavity+R9 foam ADV 2X8W T111","10-5",3.2000000000000001E-2]
[572,"R25 cavity+R10 foam STD 2X8W Lap","10-5",3.2000000000000001E-2]
[573,"R25 cavity+R10 foam INT 2X8W Lap","10-5",3.1E-2]
[574,"R25 cavity+R10 foam ADV 2X8W Lap","10-5",0.03]
[575,"R25 cavity+R10 foam STD 2X8W T111","10-5",3.3000000000000002E-2]
[576,"R25 cavity+R10 foam INT 2X8W T111","10-5",3.2000000000000001E-2]
[577,"R25 cavity+R10 foam ADV 2X8W T111","10-5",3.1E-2]
[578,"R25 cavity+R11 foam STD 2X8W Lap","10-5",3.1E-2]
[579,"R25 cavity+R11 foam INT 2X8W Lap","10-5",0.03]
[580,"R25 cavity+R11 foam ADV 2X8W Lap","10-5",2.9000000000000001E-2]
[581,"R25 cavity+R11 foam STD 2X8W T111","10-5",3.2000000000000001E-2]
[582,"R25 cavity+R11 foam INT 2X8W T111","10-5",3.1E-2]
[583,"R25 cavity+R11 foam ADV 2X8W T111","10-5",0.03]
[584,"R25 cavity+R12 foam STD 2X8W Lap","10-5",0.03]
[585,"R25 cavity+R12 foam INT 2X8W Lap","10-5",2.9000000000000001E-2]
[586,"R25 cavity+R12 foam ADV 2X8W Lap","10-5",2.8000000000000001E-2]
[587,"R25 cavity+R12 foam STD 2X8W T111","10-5",3.1E-2]
[588,"R25 cavity+R12 foam INT 2X8W T111","10-5",0.03]
[589,"R25 cavity+R12 foam ADV 2X8W T111","10-5",2.9000000000000001E-2]
[590,"R19+11 Strap 2X6W STD Lap","10-5",0.36]
[591,"R19+11 Strap 2X6W ADV Lap","10-5",3.5000000000000003E-2]
[592,"R19+11 Strap 2X6W STD T111","10-5",3.7999999999999999E-2]
[593,"R19+11 Strap 2X6W ADV T111","10-5",3.5999999999999997E-2]
[594,"R19+8 Strap 2X6W STD Lap","10-5",4.1000000000000002E-2]
[595,"R19+8 Strap 2X6W ADV Lap","10-5",3.9E-2]
[596,"R19+8 Strap 2X6W STD T111","10-5",4.2000000000000003E-2]
[597,"R19+8 Strap 2X6W ADV T111","10-5",0.04]
[598,"R19+0+11 2X6+2X4W STD Lap","10-5",0.4]
[599,"R19+0+11 2X6+2X4W ADV Lap","10-5",0.37]
[600,"R19+0+11 2X6+2X4W STD T111","10-5",4.1000000000000002E-2]
[601,"R19+0+11 2X6+2X4W ADV T111","10-5",3.7999999999999999E-2]
[602,"R19+0+19 2X6+2X4W STD Lap","10-5",3.4000000000000002E-2]
[603,"R19+0+19 2X6+2X4W ADV Lap","10-5",3.1E-2]
[604,"R19+0+19 2X6+2X4W STD T111","10-5",3.5000000000000003E-2]
[605,"R19+0+19 2X6+2X4W ADV T111","10-5",3.2000000000000001E-2]
[606,"R19+8+11 2X6+2X4W STD Lap","10-5",2.9000000000000001E-2]
[607,"R19+8+11 2X6+2X4W ADV Lap","10-5",2.8000000000000001E-2]
[608,"R19+8+11 2X6+2X4W STD T111","10-5",3.1E-2]
[{"$f":"A612+1","v":609},"R19+8+11 2X6+2X4W ADV T111","10-5",2.9000000000000001E-2]
[610,"R11+11+11 2X6+2X4W STD Lap","10-5",2.7E-2]
[611,"R11+11+11 2X6+2X4W ADV Lap","10-5",2.5999999999999999E-2]
[612,"R11+11+11 2X6+2X4W STD T111","10-5",2.8000000000000001E-2]
[613,"R11+11+11 2X6+2X4W ADV T111","10-5",2.7E-2]
[614,"R13+13+13 2X6+2X4W STD Lap","10-5",2.4E-2]
[615,"R13+13+13 2X6+2X4W ADV Lap","10-5",2.3E-2]
[616,"R13+13+13 2X6+2X4W STD T111","10-5",2.5000000000000001E-2]
[617,"R13+13+13 2X6+2X4W ADV T111","10-5",2.3E-2]
[618,"R11+19+11 2X6+2X4W STD Lap","10-5",2.1000000000000001E-2]
[619,"R11+19+11 2X6+2X4W ADV Lap","10-5",0.02]
[620,"R11+19+11 2X6+2X4W STD T111","10-5",2.1000000000000001E-2]
[621,"R11+19+11 2X6+2X4W ADV T111","10-5",0.02]
[622,"R19+0+11 2X4+2X4W STD Lap","10-5",0.05]
[623,"R19+0+11 2X4+2X4W ADV Lap","10-5",4.5999999999999999E-2]
[624,"R19+0+11 2X4+2X4W STD T111","10-5",5.1999999999999998E-2]
[625,"R19+0+11 2X4+2X4W ADV T111","10-5",4.8000000000000001E-2]
[626,"R19+0+19 2X4+2X4W STD Lap","10-5",3.9E-2]
[627,"R19+0+19 2X4+2X4W ADV Lap","10-5",3.6999999999999998E-2]
[628,"R19+0+19 2X4+2X4W STD T111","10-5",4.2999999999999997E-2]
[629,"R19+0+19 2X4+2X4W ADV T111","10-5",3.9E-2]
[630,"R19+8+11 2X4+2X4W STD Lap","10-5",3.6999999999999998E-2]
[631,"R19+8+11 2X4+2X4W ADV Lap","10-5",3.5000000000000003E-2]
[632,"R19+8+11 2X4+2X4W STD T111","10-5",3.5999999999999997E-2]
[633,"R19+8+11 2X4+2X4W ADV T111","10-5",3.5999999999999997E-2]
[634,"R11+11+11 2X4+2X4W STD Lap","10-5",3.2000000000000001E-2]
[635,"R11+11+11 2X4+2X4W ADV Lap","10-5",3.1E-2]
[636,"R11+11+11 2X4+2X4W STD T111","10-5",3.3000000000000002E-2]
[637,"R11+11+11 2X4+2X4W ADV T111","10-5",3.2000000000000001E-2]
[638,"R13+13+13 2X4+2X4W STD Lap","10-5",2.9000000000000001E-2]
[639,"R13+13+13 2X4+2X4W ADV Lap","10-5",2.8000000000000001E-2]
[640,"R13+13+13 2X4+2X4W STD T111","10-5",2.9000000000000001E-2]
[641,"R13+13+13 2X4+2X4W ADV T111","10-5",2.8000000000000001E-2]
[642,"R11+19+11 2X4+2X4W STD Lap","10-5",2.5999999999999999E-2]
[643,"R11+19+11 2X4+2X4W ADV Lap","10-5",2.5999999999999999E-2]
[644,"R11+19+11 2X4+2X4W STD T111","10-5",2.7E-2]
[645,"R11+19+11 2X4+2X4W ADV T111","10-5",2.5999999999999999E-2]
[646,"6 inch diameter log","10-5",0.14799999999999999]
[647,"8 inch diameter log","10-5",0.111]
[648,"10 inch diameter log","10-5",8.8999999999999996E-2]
[649,"12 inch diameter log","10-5",7.3999999999999996E-2]
[650,"14 inch diameter log","10-5",6.3E-2]
[651,"16 inch diameter log","10-5",5.6000000000000001E-2]
[652,"3.5\" Core Stress Skin Panel","10-5",7.0999999999999994E-2]
[653,"5.5\" Core Stress Skin Panel","10-5",4.8000000000000001E-2]
[654,"7.25\" Core Stress Skin Panel","10-5",3.6999999999999998E-2]
[655,"9.25\" Core Stress Skin Panel","10-5",0.03]
[656,"11.25\" Core Stress Skin Panel","10-5",2.5000000000000001E-2]
[657,"R11 cavity+R0 foam Metal 16\"OC","10-5",0.13200000000000001,"upddated 7/30/2021"]
[658,"R11 cavity+R1 foam Metal 16\"OC","10-5",0.11700000000000001,"upddated 7/30/2021"]
[659,"R11 cavity+R2 foam Metal 16\"OC","10-5",0.105,"upddated 7/30/2021"]
[660,"R11 cavity+R3 foam Metal 16\"OC","10-5",9.5000000000000001E-2,"upddated 7/30/2021"]
[661,"R11 cavity+R4 foam Metal 16\"OC","10-5",8.6999999999999994E-2,"upddated 7/30/2021"]
[662,"R11 cavity+R5 foam Metal 16\"OC","10-5",0.08,"upddated 7/30/2021"]
[663,"R11 cavity+R6 foam Metal 16\"OC","10-5",7.3999999999999996E-2,"upddated 7/30/2021"]
[664,"R11 cavity+R7 foam Metal 16\"OC","10-5",6.9000000000000006E-2,"upddated 7/30/2021"]
[665,"R11 cavity+R8 foam Metal 16\"OC","10-5",6.4000000000000001E-2,"upddated 7/30/2021"]
[666,"R11 cavity+R9 foam Metal 16\"OC","10-5",0.06,"upddated 7/30/2021"]
[667,"R11 cavity+R10 foam Metal 16\"OC","10-5",5.7000000000000002E-2,"upddated 7/30/2021"]
[668,"R11 cavity+R11 foam Metal 16\"OC","10-5",5.3999999999999999E-2,"upddated 7/30/2021"]
[669,"R11 cavity+R12 foam Metal 16\"OC","10-5",5.0999999999999997E-2,"upddated 7/30/2021"]
[670,"R11 cavity+R13 foam Metal 16\"OC","10-5",4.9000000000000002E-2,"upddated 7/30/2021"]
[671,"R11 cavity+R14 foam Metal 16\"OC","10-5",4.5999999999999999E-2,"upddated 7/30/2021"]
[672,"R11 cavity+R15 foam Metal 16\"OC","10-5",4.3999999999999997E-2,"upddated 7/30/2021"]
[673,"R11 cavity+R16 foam Metal 16\"OC","10-5",3.5999999999999997E-2,"upddated 7/30/2021"]
[674,"R13 cavity+R0 foam Metal 16\"OC","10-5",0.124]
[675,"R13 cavity+R1 foam Metal 16\"OC","10-5",0.111]
[676,"R13 cavity+R2 foam Metal 16\"OC","10-5",0.1]
[677,"R13 cavity+R3 foam Metal 16\"OC","10-5",9.0999999999999998E-2]
[678,"R13 cavity+R4 foam Metal 16\"OC","10-5",8.3000000000000004E-2]
[{"$f":"A682+1","v":679},"R13 cavity+R5 foam Metal 16\"OC","10-5",7.6999999999999999E-2]
[680,"R13 cavity+R6 foam Metal 16\"OC","10-5",7.0999999999999994E-2]
[681,"R13 cavity+R7 foam Metal 16\"OC","10-5",6.6000000000000003E-2]
[682,"R13 cavity+R8 foam Metal 16\"OC","10-5",6.2E-2]
[683,"R13 cavity+R9 foam Metal 16\"OC","10-5",5.8999999999999997E-2]
[684,"R13 cavity+R10 foam Metal 16\"OC","10-5",5.5E-2]
[685,"R15 cavity+R0 foam Metal 16\"OC","10-5",0.11799999999999999]
[686,"R15 cavity+R1 foam Metal 16\"OC","10-5",0.106]
[687,"R15 cavity+R2 foam Metal 16\"OC","10-5",9.6000000000000002E-2]
[688,"R15 cavity+R3 foam Metal 16\"OC","10-5",8.6999999999999994E-2]
[689,"R15 cavity+R4 foam Metal 16\"OC","10-5",0.08]
[690,"R15 cavity+R5 foam Metal 16\"OC","10-5",7.3999999999999996E-2]
[691,"R15 cavity+R6 foam Metal 16\"OC","10-5",6.9000000000000006E-2]
[692,"R15 cavity+R7 foam Metal 16\"OC","10-5",6.5000000000000002E-2]
[693,"R15 cavity+R8 foam Metal 16\"OC","10-5",6.0999999999999999E-2]
[694,"R15 cavity+R9 foam Metal 16\"OC","10-5",5.7000000000000002E-2]
[695,"R15 cavity+R10 foam Metal 16\"OC","10-5",5.3999999999999999E-2]
[696,"R19 cavity+R0 foam Metal 16\"OC","10-5",0.109]
[697,"R19 cavity+R1 foam Metal 16\"OC","10-5",9.9000000000000005E-2]
[698,"R19 cavity+R2 foam Metal 16\"OC","10-5",0.09]
[699,"R19 cavity+R3 foam Metal 16\"OC","10-5",8.2000000000000003E-2]
[700,"R19 cavity+R4 foam Metal 16\"OC","10-5",7.5999999999999998E-2]
[701,"R19 cavity+R5 foam Metal 16\"OC","10-5",7.0999999999999994E-2]
[702,"R19 cavity+R6 foam Metal 16\"OC","10-5",6.6000000000000003E-2]
[703,"R19 cavity+R7 foam Metal 16\"OC","10-5",6.2E-2]
[704,"R19 cavity+R8 foam Metal 16\"OC","10-5",5.8000000000000003E-2]
[705,"R19 cavity+R9 foam Metal 16\"OC","10-5",5.5E-2]
[706,"R19 cavity+R10 foam Metal 16\"OC","10-5",5.1999999999999998E-2]
[707,"R21 cavity+R0 foam Metal 16\"OC","10-5",0.106]
[708,"R21 cavity+R1 foam Metal 16\"OC","10-5",9.6000000000000002E-2]
[709,"R21 cavity+R2 foam Metal 16\"OC","10-5",8.6999999999999994E-2]
[710,"R21 cavity+R3 foam Metal 16\"OC","10-5",0.08]
[711,"R21 cavity+R4 foam Metal 16\"OC","10-5",7.3999999999999996E-2]
[712,"R21 cavity+R5 foam Metal 16\"OC","10-5",6.9000000000000006E-2]
[713,"R21 cavity+R6 foam Metal 16\"OC","10-5",6.5000000000000002E-2]
[714,"R21 cavity+R7 foam Metal 16\"OC","10-5",6.0999999999999999E-2]
[715,"R21 cavity+R8 foam Metal 16\"OC","10-5",5.7000000000000002E-2]
[716,"R21 cavity+R9 foam Metal 16\"OC","10-5",5.3999999999999999E-2]
[717,"R21 cavity+R10 foam Metal 16\"OC","10-5",5.0999999999999997E-2]
[718,"R25 cavity+R0 foam Metal 16\"OC","10-5",9.0999999999999998E-2]
[719,"R25 cavity+R1 foam Metal 16\"OC","10-5",8.3000000000000004E-2]
[720,"R25 cavity+R2 foam Metal 16\"OC","10-5",7.6999999999999999E-2]
[721,"R25 cavity+R3 foam Metal 16\"OC","10-5",7.0999999999999994E-2]
[722,"R25 cavity+R4 foam Metal 16\"OC","10-5",6.7000000000000004E-2]
[723,"R25 cavity+R5 foam Metal 16\"OC","10-5",6.2E-2]
[724,"R25 cavity+R6 foam Metal 16\"OC","10-5",5.8999999999999997E-2]
[725,"R25 cavity+R7 foam Metal 16\"OC","10-5",5.5E-2]
[726,"R25 cavity+R8 foam Metal 16\"OC","10-5",5.2999999999999999E-2]
[727,"R25 cavity+R9 foam Metal 16\"OC","10-5",0.05]
[728,"R25 cavity+R10 foam Metal 16\"OC","10-5",4.8000000000000001E-2]
[729,"R11 cavity+R0 foam Metal 24\"OC","10-5",0.11600000000000001]
[730,"R11 cavity+R1 foam Metal 24\"OC","10-5",0.104]
[731,"R11 cavity+R2 foam Metal 24\"OC","10-5",9.4E-2]
[732,"R11 cavity+R3 foam Metal 24\"OC","10-5",8.5999999999999993E-2]
[733,"R11 cavity+R4 foam Metal 24\"OC","10-5",7.9000000000000001E-2]
[734,"R11 cavity+R5 foam Metal 24\"OC","10-5",7.2999999999999995E-2]
[735,"R11 cavity+R6 foam Metal 24\"OC","10-5",6.8000000000000005E-2]
[736,"R11 cavity+R7 foam Metal 24\"OC","10-5",6.4000000000000001E-2]
[737,"R11 cavity+R8 foam Metal 24\"OC","10-5",0.06]
[738,"R11 cavity+R9 foam Metal 24\"OC","10-5",5.7000000000000002E-2]
[739,"R11 cavity+R10 foam Metal 24\"OC","10-5",5.3999999999999999E-2]
[740,"R13 cavity+R0 foam Metal 24\"OC","10-5",0.108]
[741,"R13 cavity+R1 foam Metal 24\"OC","10-5",9.8000000000000004E-2]
[742,"R13 cavity+R2 foam Metal 24\"OC","10-5",8.8999999999999996E-2]
[{"$f":"A746+1","v":743},"R13 cavity+R3 foam Metal 24\"OC","10-5",8.2000000000000003E-2]
[744,"R13 cavity+R4 foam Metal 24\"OC","10-5",7.4999999999999997E-2]
[745,"R13 cavity+R5 foam Metal 24\"OC","10-5",7.0000000000000007E-2]
[746,"R13 cavity+R6 foam Metal 24\"OC","10-5",6.6000000000000003E-2]
[747,"R13 cavity+R7 foam Metal 24\"OC","10-5",6.2E-2]
[748,"R13 cavity+R8 foam Metal 24\"OC","10-5",5.8000000000000003E-2]
[749,"R13 cavity+R9 foam Metal 24\"OC","10-5",5.5E-2]
[750,"R13 cavity+R10 foam Metal 24\"OC","10-5",5.1999999999999998E-2]
[751,"R15 cavity+R0 foam Metal 24\"OC","10-5",0.10199999999999999]
[752,"R15 cavity+R1 foam Metal 24\"OC","10-5",9.1999999999999998E-2]
[753,"R15 cavity+R2 foam Metal 24\"OC","10-5",8.4000000000000005E-2]
[754,"R15 cavity+R3 foam Metal 24\"OC","10-5",7.8E-2]
[755,"R15 cavity+R4 foam Metal 24\"OC","10-5",7.1999999999999995E-2]
[756,"R15 cavity+R5 foam Metal 24\"OC","10-5",6.7000000000000004E-2]
[757,"R15 cavity+R6 foam Metal 24\"OC","10-5",6.3E-2]
[758,"R15 cavity+R7 foam Metal 24\"OC","10-5",5.8999999999999997E-2]
[759,"R15 cavity+R8 foam Metal 24\"OC","10-5",5.6000000000000001E-2]
[760,"R15 cavity+R9 foam Metal 24\"OC","10-5",5.2999999999999999E-2]
[761,"R15 cavity+R10 foam Metal 24\"OC","10-5",0.05]
[762,"R19 cavity+R0 foam Metal 24\"OC","10-5",9.4E-2]
[763,"R19 cavity+R1 foam Metal 24\"OC","10-5",8.5999999999999993E-2]
[764,"R19 cavity+R2 foam Metal 24\"OC","10-5",7.9000000000000001E-2]
[765,"R19 cavity+R3 foam Metal 24\"OC","10-5",7.2999999999999995E-2]
[766,"R19 cavity+R4 foam Metal 24\"OC","10-5",6.8000000000000005E-2]
[767,"R19 cavity+R5 foam Metal 24\"OC","10-5",6.4000000000000001E-2]
[768,"R19 cavity+R6 foam Metal 24\"OC","10-5",0.06]
[769,"R19 cavity+R7 foam Metal 24\"OC","10-5",5.7000000000000002E-2]
[770,"R19 cavity+R8 foam Metal 24\"OC","10-5",5.3999999999999999E-2]
[771,"R19 cavity+R9 foam Metal 24\"OC","10-5",5.0999999999999997E-2]
[772,"R19 cavity+R10 foam Metal 24\"OC","10-5",4.8000000000000001E-2]
[773,"R21 cavity+R0 foam Metal 24\"OC","10-5",0.09]
[774,"R21 cavity+R1 foam Metal 24\"OC","10-5",8.3000000000000004E-2]
[775,"R21 cavity+R2 foam Metal 24\"OC","10-5",7.6999999999999999E-2]
[776,"R21 cavity+R3 foam Metal 24\"OC","10-5",7.0999999999999994E-2]
[777,"R21 cavity+R4 foam Metal 24\"OC","10-5",6.6000000000000003E-2]
[778,"R21 cavity+R5 foam Metal 24\"OC","10-5",6.2E-2]
[779,"R21 cavity+R6 foam Metal 24\"OC","10-5",5.8999999999999997E-2]
[780,"R21 cavity+R7 foam Metal 24\"OC","10-5",5.5E-2]
[781,"R21 cavity+R8 foam Metal 24\"OC","10-5",5.1999999999999998E-2]
[782,"R21 cavity+R9 foam Metal 24\"OC","10-5",0.05]
[783,"R21 cavity+R10 foam Metal 24\"OC","10-5",4.8000000000000001E-2]
[784,"R25 cavity+R0 foam Metal 24\"OC","10-5",7.9000000000000001E-2]
[785,"R25 cavity+R1 foam Metal 24\"OC","10-5",7.2999999999999995E-2]
[786,"R25 cavity+R2 foam Metal 24\"OC","10-5",6.8000000000000005E-2]
[787,"R25 cavity+R3 foam Metal 24\"OC","10-5",6.4000000000000001E-2]
[788,"R25 cavity+R4 foam Metal 24\"OC","10-5",0.06]
[789,"R25 cavity+R5 foam Metal 24\"OC","10-5",5.7000000000000002E-2]
[790,"R25 cavity+R6 foam Metal 24\"OC","10-5",5.3999999999999999E-2]
[791,"R25 cavity+R7 foam Metal 24\"OC","10-5",5.0999999999999997E-2]
[792,"R25 cavity+R8 foam Metal 24\"OC","10-5",4.8000000000000001E-2]
[793,"R25 cavity+R9 foam Metal 24\"OC","10-5",4.5999999999999999E-2]
[794,"R25 cavity+R10 foam Metal 24\"OC","10-5",4.3999999999999997E-2]
[795,"R0 Exposed 8\"block+empty","10-5",0.4]
[796,"R0 Exposed 8\"block+perlite ","10-5",0.23]
[797,"R0 Exposed 8\"block+vermiculite","10-5",0.24]
[798,"R0 Exposed 8\"block+solid. ","10-5",0.43]
[799,"R5 int. Wood furring 8\"block+empty ","10-5",0.14000000000000001]
[800,"R5 int. Wood furring 8\"block+perlite ","10-5",0.11]
[801,"R5 int. Wood furring 8\"block+vermiculite","10-5",0.12]
[802,"R5 int. Wood furring 8\"block+solid ","10-5",0.15]
[803,"R6 int. Wood furring 8\"block+empty ","10-5",0.14000000000000001]
[804,"R6 int. Wood furring 8\"block+perlite ","10-5",0.11]
[805,"R6 int. Wood furring 8\"block+vermiculite","10-5",0.11]
[806,"R6 int. Wood furring 8\"block+solid ","10-5",0.14000000000000001]
[{"$f":"A810+1","v":807},"R10.5 int. Wood furring 8\"block+empty ","10-5",0.11]
[808,"R10.5 int. Wood furring 8\"block+perlite ","10-5",0.09]
[809,"R10.5 int. Wood furring 8\"block+vermic.","10-5",0.09]
[810,"R10.5 int. Wood furring 8\"block+solid ","10-5",0.11]
[811,"R8 int. Metal Clips 8\"block+empty ","10-5",0.11]
[812,"R8 int. Metal Clips 8\"block+perlite ","10-5",0.09]
[813,"R8 int. Metal Clips 8\"block+vermiculite","10-5",0.09]
[814,"R8 int. Metal Clips 8\"block+solid ","10-5",0.11]
[815,"R6 Exterior  8\"block+empty ","10-5",0.12]
[816,"R6 Exterior  8\"block+perlite ","10-5",0.1]
[817,"R6 Exterior  8\"block+vermiculite","10-5",0.1]
[818,"R6 Exterior  8\"block+solid ","10-5",0.12]
[819,"R10 Exterior  8\"block+empty ","10-5",0.08]
[820,"R10 Exterior  8\"block+perlite ","10-5",7.0000000000000007E-2]
[821,"R10 Exterior  8\"block+vermiculite","10-5",7.0000000000000007E-2]
[822,"R10 Exterior  8\"block+solid ","10-5",0.08]
[823,"R9.5 Poly Two Web  8\"block+empty ","10-5",0.11]
[824,"R9.5 Poly Two Web  8\"block+perlite ","10-5",0.09]
[825,"R9.5 Poly Two Web  8\"block+vermiculite","10-5",0.09]
[826,"R9.5 Poly Two Web  8\"block+solid ","10-5",0.12]
[827,"R0 Exposed 12\"block+empty","10-5",0.35]
[828,"R0 Exposed 12\"block+perlite ","10-5",0.17]
[829,"R0 Exposed 12\"block+vermiculite","10-5",0.18]
[830,"R0 Exposed 12\"block+solid. ","10-5",0.33]
[831,"R5 int. Wood furring 12\"block+empty ","10-5",0.14000000000000001]
[832,"R5 int. Wood furring 12\"block+perlite ","10-5",0.1]
[833,"R5 int. Wood furring 12\"block+vermiculite","10-5",0.1]
[834,"R5 int. Wood furring 12\"block+solid ","10-5",0.13]
[835,"R6 int. Wood furring 12\"block+empty ","10-5",0.13]
[836,"R6 int. Wood furring 12\"block+perlite ","10-5",0.09]
[837,"R6 int. Wood furring 12\"block+vermiculite","10-5",0.1]
[838,"R6 int. Wood furring 12\"block+solid ","10-5",0.13]
[839,"R10.5 int. Wood furring 12\"block+empty ","10-5",0.11]
[840,"R10.5 int. Wood furring 12\"block+perlite ","10-5",0.08]
[841,"R10.5 int. Wood furring 12\"block+vermic.","10-5",0.08]
[842,"R10.5 int. Wood furring 12\"block+solid ","10-5",0.1]
[843,"R8 int. Metal Clips 12\"block+empty ","10-5",0.1]
[844,"R8 int. Metal Clips 12\"block+perlite ","10-5",0.08]
[845,"R8 int. Metal Clips 12\"block+vermiculite","10-5",0.08]
[846,"R8 int. Metal Clips 12\"block+solid ","10-5",0.09]
[847,"R6 Exterior  12\"block+empty ","10-5",0.11]
[848,"R6 Exterior  12\"block+perlite ","10-5",0.09]
[849,"R6 Exterior  12\"block+vermiculite","10-5",0.09]
[850,"R6 Exterior  12\"block+solid ","10-5",0.11]
[851,"R10 Exterior  12\"block+empty ","10-5",0.08]
[852,"R10 Exterior  12\"block+perlite ","10-5",0.06]
[853,"R10 Exterior  12\"block+vermiculite","10-5",0.06]
[854,"R10 Exterior  12\"block+solid ","10-5",0.08]
[855,"R9.5 Poly Two Web  12\"block+empty ","10-5",0.11]
[856,"R9.5 Poly Two Web  12\"block+perlite ","10-5",0.08]
[857,"R9.5 Poly Two Web  12\"block+vermic.","10-5",0.09]
[858,"R9.5 Poly Two Web  12\"block+solid ","10-5",0.12]
[859,"R0 Exposed 8\"brick+empty","10-5",0.5]
[860,"R0 Exposed 8\"brick+perlite ","10-5",0.31]
[861,"R0 Exposed 8\"brick+vermiculite","10-5",0.32]
[862,"R0 Exposed 8\"brick+solid. ","10-5",0.56000000000000005]
[863,"R5 Wood furring 8\"brick+empty ","10-5",0.15]
[864,"R5 int.. Wood furring 8\"brick+perlite ","10-5",0.13]
[865,"R5 int. Wood furring 8\"brick+vermiculite","10-5",0.13]
[866,"R5 int. Wood furring 8\"brick+solid ","10-5",0.16]
[867,"R6 int. Wood furring 8\"brick+empty ","10-5",0.15]
[868,"R6 int. Wood furring 8\"brick+perlite ","10-5",0.12]
[869,"R6 int. Wood furring 8\"brick+vermiculite","10-5",0.12]
[870,"R6 int. Wood furring 8\"brick+solid ","10-5",0.15]
[{"$f":"A874+1","v":871},"R10.5 int. Wood furring 8\"brick+empty ","10-5",0.12]
[872,"R10.5 int. Wood furring 8\"brick+perlite ","10-5",0.1]
[873,"R10.5 int. Wood furring 8\"brick+vermic","10-5",0.1]
[874,"R10.5 int. Wood furring 8\"brick+solid ","10-5",0.12]
[875,"R8 int. Metal Clips 8\"brick+empty ","10-5",0.11]
[876,"R8 int. Metal Clips 8\"brick+perlite ","10-5",0.1]
[877,"R8 int. Metal Clips 8\"brick+vermiculite","10-5",0.1]
[878,"R8 int. Metal Clips 8\"brick+solid ","10-5",0.11]
[879,"R6 Exterior  8\"brick+empty ","10-5",0.12]
[880,"R6 Exterior  8\"brick+perlite ","10-5",0.11]
[881,"R6 Exterior  8\"brick+vermiculite","10-5",0.11]
[882,"R6 Exterior  8\"brick+solid ","10-5",0.13]
[883,"R10 Exterior  8\"brick+empty ","10-5",0.08]
[884,"R10 Exterior  8\"brick+perlite ","10-5",0.08]
[885,"R10 Exterior  8\"brick+vermiculite","10-5",0.08]
[886,"R10 Exterior  8\"brick+solid ","10-5",0.09]
[887,"R0 Exposed 6\"Concrete+solid. ","10-5",0.61]
[888,"R5 int. Wood furring 6\"Concrete+solid ","10-5",0.16]
[889,"R6 int. Wood furring 6\"Concrete+solid ","10-5",0.15]
[890,"R10.5 int. Wood furring 6\"Concrete+solid ","10-5",0.12]
[891,"R8 int. Metal Clips 6\"Concrete+solid ","10-5",0.12]
[892,"R6 Exterior  6\"Concrete+solid ","10-5",0.13]
[893,"R10 Exterior  6\"Concrete+solid ","10-5",0.09]
[894,"Int Concrete Floors, Exposed Concrete,6\"wall","10-5B",0.81599999999999995]
[895,"Int Concrete Floors, R-5 Ext., 6\"wall","10-5B",0.161]
[896,"Int Concrete, Floors R-6 Ext., 6\"wall","10-5B",0.13800000000000001]
[897,"Int Concrete, Floors R-7 Ext., 6\"wall","10-5B",0.122]
[898,"Int Concrete, Floors R-8 Ext., 6\"wall","10-5B",0.108]
[899,"Int Concrete, Floors R-9 Ext., 6\"wall","10-5B",9.8000000000000004E-2]
[900,"Int Concrete, Floors R-10 Ext., 6\"wall","10-5B",8.8999999999999996E-2]
[901,"Int Concrete Floors, Exposed Concrete,8\"wall","10-5B",0.74099999999999999]
[902,"Int Concrete Floors, R-5 Ext., 8\"wall","10-5B",0.157]
[903,"Int Concrete, Floors R-6 Ext., 8\"wall","10-5B",0.13600000000000001]
[904,"Int Concrete, Floors R-7 Ext., 8\"wall","10-5B",0.12]
[905,"Int Concrete, Floors R-8 Ext., 8\"wall","10-5B",0.107]
[906,"Int Concrete, Floors R-9 Ext., 8\"wall","10-5B",9.7000000000000003E-2]
[907,"Int Concrete, Floors R-10 Ext., 8\"wall","10-5B",8.7999999999999995E-2]
[908,"Int Concrete Floors, Exposed Concrete,10\"wall","10-5B",0.67800000000000005]
[909,"Int Concrete Floors, R-5 Ext., 10\"wall","10-5B",0.154]
[910,"Int Concrete, Floors R-6 Ext., 10\"wall","10-5B",0.13400000000000001]
[911,"Int Concrete, Floors R-7 Ext., 10\"wall","10-5B",0.11799999999999999]
[912,"Int Concrete, Floors R-8 Ext., 10\"wall","10-5B",0.106]
[913,"Int Concrete, Floors R-9 Ext., 10\"wall","10-5B",9.5000000000000001E-2]
[914,"Int Concrete, Floors R-10 Ext., 10\"wall","10-5B",8.6999999999999994E-2]
[915,"Int Concrete Floors, Exposed Concrete,12\"wall","10-5B",0.625]
[916,"Int Concrete Floors, R-5 Ext., 12\"wall","10-5B",0.152]
[917,"Int Concrete, Floors R-6 Ext., 12\"wall","10-5B",0.13200000000000001]
[918,"Int Concrete, Floors R-7 Ext., 12\"wall","10-5B",0.11600000000000001]
[919,"Int Concrete, Floors R-8 Ext., 12\"wall","10-5B",0.104]
[920,"Int Concrete, Floors R-9 Ext., 12\"wall","10-5B",9.4E-2]
[921,"Int Concrete, Floors R-10 Ext., 12\"wall","10-5B",8.5999999999999993E-2]
[922,"ICF, R20","NEEA REMRate",4.4999999999999998E-2]
[923,"ICF, R22","NEEA REMRate",4.2000000000000003E-2]
[924,"ICF, R24","NEEA REMRate",3.7999999999999999E-2]
[925,"ICF, R25","NEEA REMRate",3.6999999999999998E-2]
[926,"ICF, R28","NEEA REMRate",3.3000000000000002E-2]
[927,"SIPS, 8\"","NEEA REMRate",0.03]
[928,"SIPS, 10\"","NEEA REMRate",2.4E-2]
[929,"SIPS, 12\"","NEEA REMRate",0.02]
[930,{"$f":"'Flat-Vaulted Ceilings'!$B$339","v":"== Custom Entries per WSEC R402.1.5 U-factor Reference and Calculations ========  "},null,null,"Notes",{"$f":"'Flat-Vaulted Ceilings'!$F$339","v":"Your entries appear at bottom of drowdown menus on \"Group R\" tab"}]
[931,"R21 cavity+R16 foam INT 2X6W T111","Custom",2.8000000000000001E-2,null,{"$f":"IF(AND(B936<>\"\",B935=\"\"),\"Don't skip lines\",IF(AND(D935=\"\",B935<>\"\"),\"Enter U-value\",IF(AND(D935<>\"\",B935=\"\"),\"Enter Description\",\"\")))","v":""}]
[932,"R23 BIBS 2x6W","Custom",5.1999999999999998E-2,null,""]
[933,"Test wall","Custom",0.1,"junk",""]
[934,null,"Custom",null,null,""]
[935,null,"Custom",null,null,""]
[936,null,"Custom",null,null,""]
[937,null,"Custom",null,null,""]
[938,null,"Custom",null,null,""]
[939,null,"Custom",null,null,""]
[940,null,"Custom",null,null,""]
[941,null,"Custom",null,null,""]
[942,null,"Custom",null,null,""]
[943,null,"Custom",null,null,""]
[{"$f":"A947+1","v":944},null,"Custom",null,null,""]
[945,null,"Custom",null,null,""]
[946,null,"Custom",null,null,""]
[947,null,"Custom",null,null,""]
[948,null,"Custom",null,null,""]
[949,null,"Custom",null,null,""]
[950,null,"Custom",null,null,""]
[951,null,"Custom",null,null,""]
[952,null,"Custom",null,null,""]
[953,null,"Custom",null,null,""]
[954,null,"Custom",null,null,""]
[955,null,"Custom",null,null,""]
[956,null,"Custom",null,null,""]
[957,null,"Custom",null,null,""]
[958,null,"Custom",null,null,""]
[959,null,"Custom",null,null,""]
[960,null,"Custom",null,null,""]
[961,null,"Custom",null,null,""]
[962,null,"Custom",null,null,""]
[963,null,"Custom",null,null,""]
[964,null,"Custom",null,null,""]
[965,null,"Custom",null,null,""]
[966,null,"Custom",null,null,""]
[967,null,"Custom",null,null,""]
[968,null,"Custom",null,null,""]
[969,null,"Custom",null,null,""]
[970,null,"Custom",null,null,""]
[971,null,"Custom",null,null,""]
[972,null,"Custom",null,null,""]
[973,null,"Custom",null,null,""]
[974,null,"Custom",null,null,""]
[975,null,"Custom",null,null,""]
[976,null,"Custom",null,null,""]
[977,null,"Custom",null,null,""]
[978,null,"Custom",null,null,""]
[979,null,"Custom",null,null,""]
[980,null,"Custom",null,null,""]
[981,null,"Custom",null,null,""]
[982,null,"Custom",null,null,""]
[983,null,"Custom",null,null,""]
[984,null,"Custom",null,null,""]
[985,null,"Custom",null,null,""]

{"sheet":"Floors","index":11,"n_rows":117,"n_cols":6,"rows_kept":117,"cut":false,"hidden":true,"merged":[]}
["WSU Code Compliance Calculator  - WSEC 2015 &2018",null,null,null,null,"(C) 2020"]
["Floor Database"]
["Index","Component Description","Reference","Floor U"]
[]
[1]
[{"$f":"A5+1","v":2},"=== Most Frequently Used ========= "]
[{"$f":"A6+1","v":3},"R0 vented Joist","10-3",0.13400000000000001]
[4,"R19 vented Joist","10-3",4.1000000000000002E-2]
[5,"R30 vented Joist (Code Baseline)","10-3",2.9000000000000001E-2]
[6,"R30 vented Post/Beam (Code Baseline)","10-3",2.8000000000000001E-2]
[7,"R38 vented Joist (2021 1.2, 1,3; 2018 1.3-1.5)","10-3",2.5000000000000001E-2]
[8,"R38 vented Post/Beam (2021 1.2, 1.3; 2018 1.3-1.5)","10-3",2.4E-2]
[9,"R48 vented Joist (2021 1.4; 2018 1.6)",null,0.02,"added 2021"]
[10,"R48 vented Post/Beam (2021 1.4; 2018 1.6)",null,0.02,"added 2021"]
[11,"No floors in thermal envelope","NA",0]
[12,"2021 U-factor Baseline (Table R402.1.2)","Table R402.1.2",2.9000000000000001E-2]
[13,"============================"]
[14,"R0 vented Joist","10-3",0.13400000000000001]
[15,"R0 vented Post/Beam","10-3",0.112]
[16,"R11 vented Joist","10-3",5.6000000000000001E-2]
[17,"R11 vented Post/Beam","10-3",5.1999999999999998E-2]
[18,"R19 vented Joist","10-3",4.1000000000000002E-2]
[19,"R19 vented Post/Beam","10-3",3.7999999999999999E-2]
[20,"R22 vented Joist","10-3",3.6999999999999998E-2]
[21,"R22 vented Post/Beam","10-3",3.4000000000000002E-2]
[22,"R25 vented Joist","10-3",3.4000000000000002E-2]
[23,"R25 vented Post/Beam","10-3",3.2000000000000001E-2]
[24,"R30 vented Joist","10-3",2.9000000000000001E-2]
[25,"R30 vented Post/Beam","10-3",2.8000000000000001E-2]
[26,"R38 vented Joist","10-3",2.5000000000000001E-2]
[27,"R38 vented Post/Beam","10-3",2.4E-2]
[28,"R11 perim vented Joist","10-3",0.11600000000000001]
[29,"R11 perim vented Post/Beam","10-3",0.1]
[30,"R19 perim vented Joist","10-3",0.114]
[31,"R19 perim vented Post/Beam","10-3",9.8000000000000004E-2]
[32,"R30 perim vented Joist","10-3",0.107]
[33,"R30 perim vented Post/Beam","10-3",9.2999999999999999E-2]
[34,"R11 + R11 perim vented Joist","10-3",5.1999999999999998E-2]
[35,"R11 + R11 perim vented Post/Beam","10-3",4.8000000000000001E-2]
[36,"R19 + R11 perim vented Joist","10-3",3.7999999999999999E-2]
[37,"R19 + R11 perim vented Post/Beam","10-3",3.5999999999999997E-2]
[38,"R22 + R11 perim vented Joist","10-3",3.5000000000000003E-2]
[39,"R22 + R11 perim vented Post/Beam","10-3",3.3000000000000002E-2]
[40,"R25 + R11 perim vented Joist","10-3",3.3000000000000002E-2]
[41,"R25 + R11 perim vented Post/Beam","10-3",3.1E-2]
[42,"R30 + R11 perim vented Joist","10-3",2.8000000000000001E-2]
[43,"R30 + R11 perim vented Post/Beam","10-3",2.7E-2]
[44,"R38 + R11 perim vented Joist","10-3",2.4E-2]
[45,"R38 + R11 perim vented Post/Beam","10-3",2.4E-2]
[46,"R11 perim unvented Heated plenum","10-4",8.5000000000000006E-2]
[47,"R19 perim unvented Heated plenum","10-4",7.4999999999999997E-2]
[48,"R30 perim unvented Heated plenum","10-4",6.9000000000000006E-2]
[49,"7.25\" stress skin panel","WSU",3.4000000000000002E-2]
[50,"9.25\" stress skin panel","WSU",2.8000000000000001E-2]
[51,"11.25\" stress skin panel","WSU",2.4E-2]
[52,"R11 Concrete Exposed","10-4A",7.6999999999999999E-2]
[53,"R15 Concrete Exposed","10-4A",5.8999999999999997E-2]
[54,"R19 Concrete Exposed","10-4A",4.8000000000000001E-2]
[55,"R21 Concrete Exposed","10-4A",4.2999999999999997E-2]
[56,"R25 Concrete Exposed","10-4A",3.6999999999999998E-2]
[57,"R30 Concrete Exposed","10-4A",3.1E-2]
[58,"R38 Concrete Exposed","10-4A",2.5000000000000001E-2]
[59,"R11 Wood Joist Exposed","10-4A",8.7999999999999995E-2]
[60,"R15 Wood Joist Exposed","10-4A",7.5999999999999998E-2]
[61,"R19 Wood Joist Exposed","10-4A",6.2E-2]
[62,"R21 Wood Joist Exposed","10-4A",5.7000000000000002E-2]
[63,"R30 Wood Joist Exposed","10-4A",5.0999999999999997E-2]
[64,"R38 Wood Joist Exposed","10-4A",0.04]
[65,"R25 Wood Joist Exposed","10-4A",3.4000000000000002E-2]
[66,"R11 Metal Joist Exposed","10-4A",0.14000000000000001]
[67,"R15 Metal Joist Exposed","10-4A",0.12]
[68,"R19 Metal Joist Exposed","10-4A",0.11]
[69,"R21 Metal Joist Exposed","10-4A",0.11]
[70,"R25 Metal Joist Exposed","10-4A",0.1]
[71,"R30 Metal Joist Exposed","10-4A",0.09]
[{"$f":"A75+1","v":72},"R38 Metal Joist Exposed","10-4A",0.08]
[73,{"$f":"'Flat-Vaulted Ceilings'!$B$339","v":"== Custom Entries per WSEC R402.1.5 U-factor Reference and Calculations ========  "},null,null,"Notes",{"$f":"'Flat-Vaulted Ceilings'!$F$339","v":"Your entries appear at bottom of drowdown menus on \"Group R\" tab"}]
[74,"R48 vented Joist","Custom",0.02,null,{"$f":"IF(AND(B79<>\"\",B78=\"\"),\"Don't skip lines\",IF(AND(D78=\"\",B78<>\"\"),\"Enter U-value\",IF(AND(D78<>\"\",B78=\"\"),\"Enter Description\",\"\")))","v":""}]
[75,"2x6 R23 cavity, 16\"oc  with 2\" XPS","Custom",3.1699999999999999E-2,null,""]
[76,null,"Custom",null,null,""]
[77,null,"Custom",null,null,""]
[78,null,"Custom",null,null,""]
[79,null,"Custom",null,null,""]
[{"$f":"A83+1","v":80},null,"Custom",null,null,""]
[81,null,"Custom",null,null,""]
[82,null,"Custom",null,null,""]
[83,null,"Custom",null,null,""]
[84,null,"Custom",null,null,""]
[85,null,"Custom",null,null,""]
[86,null,"Custom",null,null,""]
[87,null,"Custom",null,null,""]
[88,null,"Custom",null,null,""]
[89,null,"Custom",null,null,""]
[90,null,"Custom",null,null,""]
[91,null,"Custom",null,null,""]
[92,null,"Custom",null,null,""]
[93,null,"Custom",null,null,""]
[94,null,"Custom",null,null,""]
[95,null,"Custom",null,null,""]
[96,null,"Custom",null,null,""]
[97,null,"Custom",null,null,""]
[98,null,"Custom",null,null,""]
[99,null,"Custom",null,null,""]
[100,null,"Custom",null,null,""]
[101,null,"Custom",null,null,""]
[102,null,"Custom",null,null,""]
[103,null,"Custom",null,null,""]
[104,null,"Custom",null,null,""]
[105,null,"Custom",null,null,""]
[106,null,"Custom",null,null,""]
[107,null,"Custom",null,null,""]
[108,null,"Custom",null,null,""]
[109,null,"Custom",null,null,""]
[110,null,"Custom",null,null,""]
[111,null,"Custom",null,null,""]
[112,null,"Custom",null,null,""]
[113,null,"Custom",null,null,""]

{"sheet":"Slab on Grade","index":12,"n_rows":132,"n_cols":13,"rows_kept":132,"cut":false,"hidden":true,"merged":[[117,9,117,10],[117,11,117,12]]}
["WSU Code Compliance Calculator  - WSEC 2015 &2018",null,null,null,null,"(C) 2020"]
["Slab-on-Grade Database"]
["Index","Component Description","Reference","Slab F"]
[]
[1]
[{"$f":"A5+1","v":2},"=== Most Frequently Used ========= "]
[{"$f":"A6+1","v":3},"R0  uninsulated","10-2",0.73]
[4,"R10 2' vertical (Code Baseline)","10-2",0.54]
[5,"R10 2' horizontal w/TB (Code Baseline)",{"$f":"C45","v":"WSU"},{"$f":"D45","v":0.54}]
[6,"R10 4' vertical",null,{"$f":"D38","v":0.48}]
[7,"R10 4' horizontal w/TB",null,{"$f":"D49","v":0.48}]
[8,"R-7.5 On top of slab (Existing slab conversion only)","Footnote, Table 402",0.54]
[9,"R10 Fully insulated Heated (Code Baseline)","10-2",0.55000000000000004]
[10,"R10 Fully insulated (2018 1.3-1.5) ","10-2",0.36]
[11,"R20 Fully insulated (2018 1.6)","Table A6.3, ASHRAE 90.1",0.26100000000000001]
[12,{"$f":"B68","v":"R20 Fully insulated Heated"},{"$f":"C68","v":"Table A6.3, ASHRAE 90.1"},{"$f":"D68","v":0.373}]
[13,"No slab on grade","NA",0]
[14,"2021 U-factor Baseline (Table R402.1.2)","Table R402.1.2",0.54]
[15,"============================"]
[16,"R0  uninsulated","10-2",0.73]
[17,"R5 2' horizontal, no TB","10-2",0.7]
[18,"R7.5 2' horizontal, no TB","10-2",0.7]
[19,"R10 2' horizontal, no TB","10-2",0.7]
[20,"R15 2' horizontal, no TB","10-2",0.69]
[21,"R5 4' horizontal, no TB","10-2",0.67]
[22,"R7.5 4' horizontal, no TB","WSU",0.65500000000000003]
[23,"R10 4' horizontal, no TB","10-2",0.64]
[24,"R15 4' horizontal, no TB","10-2",0.63]
[25,"R5 2' vertical","10-2",0.57999999999999996]
[26,"R7.5 2' vertical","WSU",0.56000000000000005]
[27,"R10 2' vertical","10-2",0.54]
[28,"R15 2' vertical","10-2",0.52]
[29,"R20 2' Vertical","ASHRAE Table 6.3.1-1",0.51]
[30,"R25 2' Vertical","ASHRAE Table 6.3.1-1",0.505]
[31,"R30 2' Vertical","ASHRAE Table 6.3.1-1",0.502]
[32,"R5 4' vertical","10-2",0.54]
[33,"R7.5 4' vertical","WSU",0.51]
[34,"R10 4' vertical","10-2",0.48]
[35,"R15 4' vertical","10-2",0.45]
[36,"R20 4' Vertical","ASHRAE Table 6.3.1-1",0.434]
[37,"R25 4' Vertical","ASHRAE Table 6.3.1-1",0.42399999999999999]
[38,"R30 4' Vertical","ASHRAE Table 6.3.1-1",0.41899999999999998]
[39,"R5 2' horizontal w/TB","WSU",0.57999999999999996]
[40,"R7.5 2' horizontal w/TB","WSU",0.56000000000000005]
[41,"R10 2' horizontal w/TB","WSU",0.54]
[42,"R15 2' horizontal w/TB","WSU",0.52]
[43,"R5 4' horizontal w/TB","WSU",0.54]
[44,"R7.5 4' horizontal w/TB","WSU",0.51]
[45,"R10 4' horizontal w/TB","WSU",0.48]
[46,"R15 4' horizontal w/TB","WSU",0.45]
[47,"R5 Fully insulated","WSU",0.46]
[48,"R10 Fully insulated","10-2",0.36]
[49,"R15 Fully insulated","WSU",0.3]
[50,"R20 Fully insulated","Table A6.3, ASHRAE 90.1",0.26100000000000001,"Added 2020"]
[51,"R25 Fully insulated","Table A6.3, ASHRAE 90.1",0.23300000000000001,"Added 2020"]
[52,"R30 Fully insulated","Table A6.3, ASHRAE 90.1",0.21299999999999999,"Added 2020"]
[53,"R35 Fully insulated","Table A6.3, ASHRAE 90.1",0.19800000000000001,"Added 2020"]
[54,"R40 Fully insulated","Table A6.3, ASHRAE 90.1",0.186,"Added 2020"]
[55,"R45 Fully insulated","Table A6.3, ASHRAE 90.1",0.17599999999999999,"Added 2020"]
[56,"R50 Fully insulated","Table A6.3, ASHRAE 90.1",0.16800000000000001,"Added 2020"]
[57,"R10 2' perim/R5 center","WSU",0.42]
[58,"R15 2' perim/R5 center","WSU",0.4]
[59,"R15 2' perim/R10 center","WSU",0.34]
[60,"R0  Uninsulated Heated","10-2",0.84]
[61,"R5 Fully insulated Heated","10-2",0.74]
[62,"R10 Fully insulated Heated","10-2",0.55000000000000004]
[63,"R15 Fully insulated Heated","10-2",0.44]
[64,"R20 Fully insulated Heated","Table A6.3, ASHRAE 90.1",0.373,"Added 2020"]
[65,"R25 Fully insulated Heated","Table A6.3, ASHRAE 90.1",0.32600000000000001,"Added 2020"]
[66,"R30 Fully insulated Heated","Table A6.3, ASHRAE 90.1",0.29599999999999999,"Added 2020"]
[67,"R35 Fully insulated Heated","Table A6.3, ASHRAE 90.1",0.27300000000000002,"Added 2020"]
[68,"R40 Fully insulated Heated","Table A6.3, ASHRAE 90.1",0.255,"Added 2020"]
[69,"R45 Fully insulated Heated","Table A6.3, ASHRAE 90.1",0.23899999999999999,"Added 2020"]
[70,"R50 Fully insulated Heated","Table A6.3, ASHRAE 90.1",0.22700000000000001,"Added 2020"]
[71,"R10 perim/R5 center Heated","10-2",0.66]
[72,"R15 perim/R5 center Heated","10-2",0.62]
[73,"R15 perim/R10 center Heated","10-2",0.51]
[74,"R10 3' vertical Heated","10-2",0.78]
[75,{"$f":"'Flat-Vaulted Ceilings'!$B$339","v":"== Custom Entries per WSEC R402.1.5 U-factor Reference and Calculations ========  "},null,null,"Notes",null,null,null,"CALCULATOR 1: Calculate F-value of heated and unheated fully insulated slab from R-value of insulation"]
[76,{"$f":"K81","v":"R-15 fully insulated unheated (est from ASHRAE 90.1/Baylon & Kennedy(2007) fit"},"Custom",{"$f":"J81","v":0.29467805199000019},"Estimated from ASHRAE 90.1",{"$f":"IF(AND(B81<>\"\",B80=\"\"),\"Don't skip lines\",IF(AND(D80=\"\",B80<>\"\"),\"Enter U-value\",IF(AND(D80<>\"\",B80=\"\"),\"Enter Description\",\"\")))","v":""},null,null,"R-value","F-value"]
[77,"R-6 fully insulated unheated (est from ASHRAE 90.1/Baylon & Kennedy(2007) fit","Custom",0.40376168090312503,"Estimated from ASHRAE 90.1","",null,"Unheated",15,{"$f":" -0.000000013453*I81^ 5 + 0.000002212251*I81^4 - 0.000138923855*I81^3 + 0.004230815068*I81^2 - 0.067716536027*I81 + 0.72558137772","v":0.29467805199000019},{"$f":"IF(I81=\"\",\"-\",CONCATENATE(\"R-\",ROUND(I81,2),\" fully insulated unheated (est from ASHRAE 90.1/Baylon & Kennedy(2007) fit\"))","v":"R-15 fully insulated unheated (est from ASHRAE 90.1/Baylon & Kennedy(2007) fit"}]
[78,null,"Custom",null,null,"",null,"Heated",20,{"$f":" 0.000000001436 * I82^ 6 - 0.000000270926* I82^5 + 0.000020204643* I82^4 - 0.000761958487* I82^3 + 0.01558421065* I82^2 - 0.178004711492* I82 + 1.34614970999","v":0.3817555241499988},{"$f":"IF(I82=\"\",\"-\",CONCATENATE(\"R-\",ROUND(I82,2),\" fully insulated heated (est from ASHRAE 90.1/Baylon & Kennedy(2007) fit\"))","v":"R-20 fully insulated heated (est from ASHRAE 90.1/Baylon & Kennedy(2007) fit"}]
[79,null,"Custom",null,null,""]
[80,null,"Custom",null,null,""]
[81,null,"Custom",null,null,""]
[82,null,"Custom",null,null,""]
[83,null,"Custom",null,null,""]
[84,null,"Custom",null,null,""]
[85,null,"Custom",null,null,""]
[86,null,"Custom",null,null,""]
[87,null,"Custom",null,null,""]
[]
[]
[]
[]
[]
[]
[]
[]
[]
[]
[]
[]
[]
[]
[]
[]
[]
[null,null,null,null,null,null,null,null,"References"]
[null,null,null,null,null,null,null,null,"ASHARAE 90.1 \"Energy Standard for Buildings Except Low-Rise Residential Buildings\""]
[null,null,null,null,null,null,null,null,"Link","https://www.usailighting.com/stuff/contentmgr/files/1/b90ce247855d0f17438484c003877338/misc/ashrae_90_1_2010.pdf"]
[null,null,null,null,null,null,null,null,"SBCC Interpretation of Table A6.3",null,"https://www.ashrae.org/File%20Library/Technical%20Resources/Standards%20and%20Guidelines/Standards%20Intepretations/IC-90.1-2007-27.pdf"]
[null,null,null,null,null,null,null,null,"Data from Table A6.3 is from Baylon and Kennedy \"Calculating the Impact of Ground Contact on Residential Heat Loss\", 2007, ASHRAE"]
[null,null,null,null,null,null,null,null,"https://web.ornl.gov/sci/buildings/conf-archive/2007%20B10%20papers/092_Baylon.pdf"]
[null,null,null,null,null,null,null,null,"For Table A6.3 refer to ",null,"https://unmethours.com/question/3629/f-factor-calculation-ashrae-901-2007-table-a63/"]
[null,null,null,null,null,null,null,null,"Ecotope: 1991_012_SuperGoodCentsHeat-V4.pdf"]
[]
[null,null,null,null,null,null,null,null,null,"Data from Table A6.3",null,"Curve Fit"]
[null,null,null,null,null,null,null,null,"R-Value","Unheated Slab","Heated Slab","Unheated Slab","Heated Slab"]
[null,null,null,null,null,null,null,null,0,0.73,1.35,{"$f":" -0.000000013453*I120^ 5 + 0.000002212251*I120^4 - 0.000138923855*I120^3 + 0.004230815068*I120^2 - 0.067716536027*I120 + 0.72558137772","v":0.72558137771999998},{"$f":" 0.000000001436 * I120^ 6 - 0.000000270926* I120^5 + 0.000020204643* I120^4 - 0.000761958487* I120^3 + 0.01558421065* I120^2 - 0.178004711492* I120 + 1.34614970999","v":1.3461497099899999}]
[null,null,null,null,null,null,null,null,5,0.46,0.74,{"$f":" -0.000000013453*I121^ 5 + 0.000002212251*I121^4 - 0.000138923855*I121^3 + 0.004230815068*I121^2 - 0.067716536027*I121 + 0.72558137772","v":0.47674420866},{"$f":" 0.000000001436 * I121^ 6 - 0.000000270926* I121^5 + 0.000020204643* I121^4 - 0.000761958487* I121^3 + 0.01558421065* I121^2 - 0.178004711492* I121 + 1.34614970999","v":0.76229030352999982}]
[null,null,null,null,null,null,null,null,7.5,0.41,0.64,0.4037626581979688,0.62403011557343746]
[null,null,null,null,null,null,null,null,10,0.36,0.55000000000000004,0.35335087925000003,0.53895500306999966]
[null,null,null,null,null,null,null,null,15,0.3,0.44,0.29467805199000019,0.44439909836000013]
[null,null,null,null,null,null,null,null,20,0.26100000000000001,0.373,0.26309640438000015,0.3817555241499988]
[null,null,null,null,null,null,null,null,25,0.23300000000000001,0.32600000000000001,0.23902575392000047,0.32782511019000027]
[null,null,null,null,null,null,null,null,30,0.21299999999999999,0.29599999999999999,0.21589018311000063,0.28802183123000025]
[null,null,null,null,null,null,null,null,35,0.19800000000000001,0.27300000000000002,0.19507316445000078,0.26747305702000035]
[null,null,null,null,null,null,null,null,40,0.186,0.255,0.18087268544000179,0.25827480230999389]
[null,null,null,null,null,null,null,null,45,0.17599999999999999,0.23899999999999999,0.17545637358000188,0.24290197685000359]
[null,null,null,null,null,null,null,null,50,0.16800000000000001,0.22700000000000001,0.17381662137000187,0.21377363539000016]
[null,null,null,null,null,null,null,null,55,0.161,0.217,0.15872571131000535,0.20897322768000337]

{"sheet":"Below Grade Walls & Slabs","index":13,"n_rows":206,"n_cols":14,"rows_kept":206,"cut":false,"hidden":true,"merged":[]}
["WSU Code Compliance Calculator  - WSEC 2015 &2018",null,null,null,null,null,"(C) 2020"]
["Below Grade Walls and Slabs - Updated to WSEC 2018, Appendix A, Table A104.1 (values changed from WSEC 2015 Appendix A)"]
["Index",null,"Component Description","Reference","Wall U","Slab F"]
[1,null,1,2,3,4,null,null,null,null,null,null,null,"Figures from:  Baylon & Kennedy, https://web.ornl.gov/sci/buildings/conf-archive/2007%20B10%20papers/092_Baylon.pdf"]
[{"$f":"A4+1","v":2},null,"=== Most Frequently Used ========= "]
[{"$f":"A5+1","v":3},"2' depth",{"$f":"'Below Grade Walls & Slabs'!F159","v":"R0  Uninsulated, 2' depth"},{"$f":"'Below Grade Walls & Slabs'!D159","v":"10-1"},{"$f":"VLOOKUP($C6,$C$28:$F$118,E$4,FALSE)","v":0.33100000000000002},0.57999999999999996,{"$f":"'Below Grade Walls & Slabs'!E159","v":"Updated to WSEC 2018"}]
[4,"2' depth",{"$f":"'Below Grade Walls & Slabs'!F160","v":"R10 Foam Ext, 2' depth"},{"$f":"'Below Grade Walls & Slabs'!D160","v":"10-1"},8.8999999999999996E-2,0.56000000000000005,{"$f":"'Below Grade Walls & Slabs'!E160","v":"Updated to WSEC 2018"}]
[5,"2' depth",{"$f":"'Below Grade Walls & Slabs'!F161","v":"R11 Batt, 2' depth"},{"$f":"'Below Grade Walls & Slabs'!D161","v":"10-1"},6.3E-2,0.67,{"$f":"'Below Grade Walls & Slabs'!E161","v":"Updated to WSEC 2018"}]
[6,"2' depth",{"$f":"'Below Grade Walls & Slabs'!F162","v":"R12 Foam Ext, 2' depth"},{"$f":"'Below Grade Walls & Slabs'!D162","v":"10-1"},{"$f":"VLOOKUP($C9,$C$28:$F$118,E$4,FALSE)","v":0.61},0.6,{"$f":"'Below Grade Walls & Slabs'!E162","v":"Updated to WSEC 2018"}]
[7,"2' depth",{"$f":"'Below Grade Walls & Slabs'!F163","v":"R10 Foam Ext w/TB, R10 Full Underslab, 2' depth"},{"$f":"'Below Grade Walls & Slabs'!D163","v":"Baylon & Kennedy, https://web.ornl.gov/sci/buildings/conf-archive/2007%20B10%20papers/092_Baylon.pdf"},6.8000000000000005E-2,0.34499999999999997,{"$f":"'Below Grade Walls & Slabs'!E163","v":"Added 2020"}]
[8,"2' depth",{"$f":"'Below Grade Walls & Slabs'!F164","v":"R20 Foam Ext w/TB, R10 Full Underslab, 2' depth"},{"$f":"'Below Grade Walls & Slabs'!D164","v":"Baylon & Kennedy, https://web.ornl.gov/sci/buildings/conf-archive/2007%20B10%20papers/092_Baylon.pdf"},0.04,0.35,{"$f":"'Below Grade Walls & Slabs'!E164","v":"Added 2020 from reference"}]
[9,"2' depth",{"$f":"'Below Grade Walls & Slabs'!F165","v":"R21 Batt w/TB, 2' depth"},{"$f":"'Below Grade Walls & Slabs'!D165","v":"WSU"},4.2000000000000003E-2,0.59,{"$f":"'Below Grade Walls & Slabs'!E165","v":"Updated to WSEC 2018"}]
[10,"3.5' depth",{"$f":"'Below Grade Walls & Slabs'!I159","v":"R0  Uninsulated, 3.5' depth"},{"$f":"'Below Grade Walls & Slabs'!D159","v":"10-1"},0.27100000000000002,0.51,{"$f":"G6","v":"Updated to WSEC 2018"}]
[11,"3.5' depth",{"$f":"'Below Grade Walls & Slabs'!I160","v":"R10 Foam Ext, 3.5' depth"},{"$f":"'Below Grade Walls & Slabs'!D160","v":"10-1"},7.4999999999999997E-2,0.52,{"$f":"G7","v":"Updated to WSEC 2018"}]
[12,"3.5' depth",{"$f":"'Below Grade Walls & Slabs'!I161","v":"R11 Batt, 3.5' depth"},{"$f":"'Below Grade Walls & Slabs'!D161","v":"10-1"},5.8000000000000003E-2,0.61,"Updated to WSEC 2018"]
[13,"3.5' depth",{"$f":"'Below Grade Walls & Slabs'!I162","v":"R12 Foam Ext, 3.5' depth"},{"$f":"'Below Grade Walls & Slabs'!D162","v":"10-1"},5.7000000000000002E-2,0.56999999999999995,"Updated to WSEC 2018"]
[14,"3.5' depth",{"$f":"'Below Grade Walls & Slabs'!I163","v":"R10 Foam Ext w/TB, R10 Full Underslab, 3.5' depth"},{"$f":"'Below Grade Walls & Slabs'!D163","v":"Baylon & Kennedy, https://web.ornl.gov/sci/buildings/conf-archive/2007%20B10%20papers/092_Baylon.pdf"},6.4000000000000001E-2,0.32400000000000001,"Added 2020"]
[15,"3.5' depth",{"$f":"'Below Grade Walls & Slabs'!I164","v":"R20 Foam Ext w/TB, R10 Full Underslab, 3.5' depth"},{"$f":"'Below Grade Walls & Slabs'!D164","v":"Baylon & Kennedy, https://web.ornl.gov/sci/buildings/conf-archive/2007%20B10%20papers/092_Baylon.pdf"},3.7999999999999999E-2,0.33100000000000002,"Added 2020 from reference"]
[16,"3.5' depth",{"$f":"'Below Grade Walls & Slabs'!I165","v":"R21 Batt w/TB, 3.5' depth"},{"$f":"'Below Grade Walls & Slabs'!D165","v":"WSU"},0.04,0.56000000000000005,"Updated to WSEC 2018"]
[17,"7' depth",{"$f":"'Below Grade Walls & Slabs'!L159","v":"R0  Uninsulated, 7' depth"},{"$f":"'Below Grade Walls & Slabs'!D159","v":"10-1"},0.185,0.43,{"$f":"G6","v":"Updated to WSEC 2018"}]
[18,"7' depth",{"$f":"'Below Grade Walls & Slabs'!L160","v":"R10 Foam Ext, 7' depth"},{"$f":"'Below Grade Walls & Slabs'!D160","v":"10-1"},5.8000000000000003E-2,0.47,{"$f":"G7","v":"Updated to WSEC 2018"}]
[19,"7' depth",{"$f":"'Below Grade Walls & Slabs'!L161","v":"R11 Batt, 7' depth"},{"$f":"'Below Grade Walls & Slabs'!D161","v":"10-1"},5.0999999999999997E-2,0.54100000000000004,"Updated to WSEC 2018"]
[20,"7' depth",{"$f":"'Below Grade Walls & Slabs'!L162","v":"R12 Foam Ext, 7' depth"},{"$f":"'Below Grade Walls & Slabs'!D162","v":"10-1"},0.05,0.42,"Updated to WSEC 2018"]
[21,"7' depth",{"$f":"'Below Grade Walls & Slabs'!L163","v":"R10 Foam Ext w/TB, R10 Full Underslab, 7' depth"},{"$f":"'Below Grade Walls & Slabs'!D163","v":"Baylon & Kennedy, https://web.ornl.gov/sci/buildings/conf-archive/2007%20B10%20papers/092_Baylon.pdf"},5.5E-2,0.29299999999999998,"Added 2020"]
[22,"7' depth",{"$f":"'Below Grade Walls & Slabs'!L164","v":"R20 Foam Ext w/TB, R10 Full Underslab, 7' depth"},{"$f":"'Below Grade Walls & Slabs'!D164","v":"Baylon & Kennedy, https://web.ornl.gov/sci/buildings/conf-archive/2007%20B10%20papers/092_Baylon.pdf"},3.4000000000000002E-2,0.30399999999999999,"Added 2020 from reference"]
[23,"7' depth",{"$f":"'Below Grade Walls & Slabs'!L165","v":"R21 Batt w/TB, 7' depth"},{"$f":"'Below Grade Walls & Slabs'!D165","v":"WSU"},3.5000000000000003E-2,0.5,"Updated to WSEC 2018"]
[24,null,{"$f":"'Below Grade Walls & Slabs'!C166","v":"============================"}]
[25,"2' depth",{"$f":"'Below Grade Walls & Slabs'!F167","v":"R0  Uninsulated, 2' depth"},{"$f":"'Below Grade Walls & Slabs'!E167","v":"Updated to WSEC 2018"},{"$f":"'Below Grade Walls & Slabs'!G167","v":0.33100000000000002},{"$f":"'Below Grade Walls & Slabs'!H167","v":0.57999999999999996},{"$f":"'Below Grade Walls & Slabs'!E167","v":"Updated to WSEC 2018"}]
[26,"2' depth",{"$f":"'Below Grade Walls & Slabs'!F168","v":"R10 Foam Ext, 2' depth"},{"$f":"'Below Grade Walls & Slabs'!E168","v":"Updated to WSEC 2018"},{"$f":"'Below Grade Walls & Slabs'!G168","v":8.8999999999999996E-2},{"$f":"'Below Grade Walls & Slabs'!H168","v":0.56000000000000005},{"$f":"'Below Grade Walls & Slabs'!E170","v":"Updated to WSEC 2018"}]
[null,null,{"$f":"'Below Grade Walls & Slabs'!F169","v":"R10 Foam Ext w/TB, R10 Full Underslab, 2' depth"},{"$f":"'Below Grade Walls & Slabs'!E169","v":"Added 2020"},{"$f":"'Below Grade Walls & Slabs'!G169","v":6.8000000000000005E-2},{"$f":"'Below Grade Walls & Slabs'!H169","v":0.34499999999999997},{"$f":"'Below Grade Walls & Slabs'!E171","v":"Updated to WSEC 2018"}]
[{"$f":"A29+1","v":27},"2' depth",{"$f":"'Below Grade Walls & Slabs'!F170","v":"R11 Batt, 2' depth"},{"$f":"'Below Grade Walls & Slabs'!E170","v":"Updated to WSEC 2018"},{"$f":"'Below Grade Walls & Slabs'!G170","v":6.3E-2},{"$f":"'Below Grade Walls & Slabs'!H170","v":0.67},{"$f":"'Below Grade Walls & Slabs'!E172","v":"Added 2023 from reference"}]
[28,"2' depth",{"$f":"'Below Grade Walls & Slabs'!F171","v":"R11 Batt w/TB, 2' depth"},{"$f":"'Below Grade Walls & Slabs'!E171","v":"Updated to WSEC 2018"},{"$f":"'Below Grade Walls & Slabs'!G171","v":6.5000000000000002E-2},{"$f":"'Below Grade Walls & Slabs'!H171","v":0.59},{"$f":"'Below Grade Walls & Slabs'!E173","v":"Added 2020 from reference"}]
[29,"2' depth",{"$f":"'Below Grade Walls & Slabs'!F172","v":"R11 Batt + R5 ci, 2' depth"},{"$f":"'Below Grade Walls & Slabs'!E172","v":"Added 2023 from reference"},{"$f":"'Below Grade Walls & Slabs'!G172","v":4.3999999999999997E-2},{"$f":"'Below Grade Walls & Slabs'!H172","v":0.67700000000000005},{"$f":"'Below Grade Walls & Slabs'!E174","v":"Added 2020 from reference"}]
[30,"2' depth",{"$f":"'Below Grade Walls & Slabs'!F173","v":"R11 Batt + R5 ci w/TB, 2' depth"},{"$f":"'Below Grade Walls & Slabs'!E173","v":"Added 2020 from reference"},{"$f":"'Below Grade Walls & Slabs'!G173","v":4.5999999999999999E-2},{"$f":"'Below Grade Walls & Slabs'!H173","v":0.59},{"$f":"'Below Grade Walls & Slabs'!E175","v":"Updated to WSEC 2018"}]
[31,"2' depth",{"$f":"'Below Grade Walls & Slabs'!F174","v":"R11 Batt + R5 ci R10 Fully Underslab, 2' depth"},{"$f":"'Below Grade Walls & Slabs'!E174","v":"Added 2020 from reference"},{"$f":"'Below Grade Walls & Slabs'!G174","v":4.8000000000000001E-2},{"$f":"'Below Grade Walls & Slabs'!H174","v":0.34799999999999998},{"$f":"'Below Grade Walls & Slabs'!E176","v":"Interpolated between R11 and R19"}]
[32,"2' depth",{"$f":"'Below Grade Walls & Slabs'!F175","v":"R12 Foam Ext, 2' depth"},{"$f":"'Below Grade Walls & Slabs'!E175","v":"Updated to WSEC 2018"},{"$f":"'Below Grade Walls & Slabs'!G175","v":0.61},{"$f":"'Below Grade Walls & Slabs'!H175","v":0.6},{"$f":"'Below Grade Walls & Slabs'!E177","v":"Interpolated between R11 and R19"}]
[33,"2' depth",{"$f":"'Below Grade Walls & Slabs'!F176","v":"R13 Batt, 2' depth"},{"$f":"'Below Grade Walls & Slabs'!E176","v":"Interpolated between R11 and R19"},{"$f":"'Below Grade Walls & Slabs'!G176","v":5.7750000000000003E-2},{"$f":"'Below Grade Walls & Slabs'!H176","v":0.6725000000000001},{"$f":"'Below Grade Walls & Slabs'!E178","v":"Interpolated between R11 and R19"}]
[34,"2' depth",{"$f":"'Below Grade Walls & Slabs'!F177","v":"R13 Batt w/TB , 2' depth"},{"$f":"'Below Grade Walls & Slabs'!E177","v":"Interpolated between R11 and R19"},{"$f":"'Below Grade Walls & Slabs'!G177","v":0.06},{"$f":"'Below Grade Walls & Slabs'!H177","v":0.59},{"$f":"'Below Grade Walls & Slabs'!E179","v":"Interpolated between R11 and R19"}]
[35,"2' depth",{"$f":"'Below Grade Walls & Slabs'!F178","v":"R13 Batt + R5 ci, 2' depth"},{"$f":"'Below Grade Walls & Slabs'!E178","v":"Interpolated between R11 and R19"},{"$f":"'Below Grade Walls & Slabs'!G178","v":4.1249999999999995E-2},{"$f":"'Below Grade Walls & Slabs'!H178","v":0.67825000000000002},{"$f":"'Below Grade Walls & Slabs'!E180","v":"Interpolated between R11 and R19"}]
[36,"2' depth",{"$f":"'Below Grade Walls & Slabs'!F179","v":"R13 Batt + R5 ci R10 Fully Underslab, 2' depth"},{"$f":"'Below Grade Walls & Slabs'!E179","v":"Interpolated between R11 and R19"},{"$f":"'Below Grade Walls & Slabs'!G179","v":4.4999999999999998E-2},{"$f":"'Below Grade Walls & Slabs'!H179","v":0.34849999999999998},{"$f":"'Below Grade Walls & Slabs'!E181","v":"Interpolated between R11 and R19"}]
[37,"2' depth",{"$f":"'Below Grade Walls & Slabs'!F180","v":"R15 Batt, 2' depth"},{"$f":"'Below Grade Walls & Slabs'!E180","v":"Interpolated between R11 and R19"},{"$f":"'Below Grade Walls & Slabs'!G180","v":5.2500000000000005E-2},{"$f":"'Below Grade Walls & Slabs'!H180","v":0.67500000000000004},{"$f":"'Below Grade Walls & Slabs'!E182","v":"Updated to WSEC 2018"}]
[38,"2' depth",{"$f":"'Below Grade Walls & Slabs'!F181","v":"R15 Batt w/TB, 2' depth"},{"$f":"'Below Grade Walls & Slabs'!E181","v":"Interpolated between R11 and R19"},{"$f":"'Below Grade Walls & Slabs'!G181","v":5.5E-2},{"$f":"'Below Grade Walls & Slabs'!H181","v":0.59},{"$f":"'Below Grade Walls & Slabs'!E183","v":"Updated to WSEC 2018"}]
[39,"2' depth",{"$f":"'Below Grade Walls & Slabs'!F182","v":"R19 Batt, 2' depth"},{"$f":"'Below Grade Walls & Slabs'!E182","v":"Updated to WSEC 2018"},{"$f":"'Below Grade Walls & Slabs'!G182","v":4.2000000000000003E-2},{"$f":"'Below Grade Walls & Slabs'!H182","v":0.68},{"$f":"'Below Grade Walls & Slabs'!E184","v":"Added 2023 from reference"}]
[40,"2' depth",{"$f":"'Below Grade Walls & Slabs'!F183","v":"R19 Batt w/TB, 2' depth"},{"$f":"'Below Grade Walls & Slabs'!E183","v":"Updated to WSEC 2018"},{"$f":"'Below Grade Walls & Slabs'!G183","v":4.4999999999999998E-2},{"$f":"'Below Grade Walls & Slabs'!H183","v":0.59},{"$f":"'Below Grade Walls & Slabs'!E185","v":"Added 2023 from reference"}]
[41,"2' depth",{"$f":"'Below Grade Walls & Slabs'!F184","v":"R19 Batt + R5 ci, 2' depth"},{"$f":"'Below Grade Walls & Slabs'!E184","v":"Added 2023 from reference"},{"$f":"'Below Grade Walls & Slabs'!G184","v":3.3000000000000002E-2},{"$f":"'Below Grade Walls & Slabs'!H184","v":0.68200000000000005},{"$f":"'Below Grade Walls & Slabs'!E186","v":"Added 2023 from reference"}]
[42,"2' depth",{"$f":"'Below Grade Walls & Slabs'!F185","v":"R19 Batt + R5 ci w/TB, 2' depth"},{"$f":"'Below Grade Walls & Slabs'!E185","v":"Added 2023 from reference"},{"$f":"'Below Grade Walls & Slabs'!G185","v":3.4000000000000002E-2},{"$f":"'Below Grade Walls & Slabs'!H185","v":0.59399999999999997},{"$f":"'Below Grade Walls & Slabs'!E187","v":"Added 2020 from reference"}]
[43,"2' depth",{"$f":"'Below Grade Walls & Slabs'!F186","v":"R19 Batt + R5 ci R10 Fully Underslab, 2' depth"},{"$f":"'Below Grade Walls & Slabs'!E186","v":"Added 2023 from reference"},{"$f":"'Below Grade Walls & Slabs'!G186","v":3.5999999999999997E-2},{"$f":"'Below Grade Walls & Slabs'!H186","v":0.35},{"$f":"'Below Grade Walls & Slabs'!E188","v":"Updated to WSEC 2018"}]
[44,"2' depth",{"$f":"'Below Grade Walls & Slabs'!F187","v":"R20 Foam Ext w/TB, R10 Full Underslab, 2' depth"},{"$f":"'Below Grade Walls & Slabs'!E187","v":"Added 2020 from reference"},{"$f":"'Below Grade Walls & Slabs'!G187","v":0.04},{"$f":"'Below Grade Walls & Slabs'!H187","v":0.35},{"$f":"'Below Grade Walls & Slabs'!E189","v":"Updated to WSEC 2018"}]
[45,"2' depth",{"$f":"'Below Grade Walls & Slabs'!F188","v":"R21 Batt, 2' depth"},{"$f":"'Below Grade Walls & Slabs'!E188","v":"Updated to WSEC 2018"},{"$f":"'Below Grade Walls & Slabs'!G188","v":0.04},{"$f":"'Below Grade Walls & Slabs'!H188","v":0.68},{"$f":"'Below Grade Walls & Slabs'!E190","v":"Added in  WSEC 2018"}]
[46,"2' depth",{"$f":"'Below Grade Walls & Slabs'!F189","v":"R21 Batt w/TB, 2' depth"},{"$f":"'Below Grade Walls & Slabs'!E189","v":"Updated to WSEC 2018"},{"$f":"'Below Grade Walls & Slabs'!G189","v":4.2000000000000003E-2},{"$f":"'Below Grade Walls & Slabs'!H189","v":0.59},{"$f":"'Below Grade Walls & Slabs'!E191","v":"Added in  WSEC 2018"}]
[47,"2' depth",{"$f":"'Below Grade Walls & Slabs'!F190","v":"R21 Batt + R5 ci, 2' depth"},{"$f":"'Below Grade Walls & Slabs'!E190","v":"Added in  WSEC 2018"},{"$f":"'Below Grade Walls & Slabs'!G190","v":3.1E-2},{"$f":"'Below Grade Walls & Slabs'!H190","v":0.68},{"$f":"'Below Grade Walls & Slabs'!E192","v":"Added in  WSEC 2018"}]
[48,"2' depth",{"$f":"'Below Grade Walls & Slabs'!F191","v":"R21 Batt + R5 ci w/TB, 2' depth"},{"$f":"'Below Grade Walls & Slabs'!E191","v":"Added in  WSEC 2018"},{"$f":"'Below Grade Walls & Slabs'!G191","v":3.2000000000000001E-2},{"$f":"'Below Grade Walls & Slabs'!H191","v":0.59},{"$f":"'Below Grade Walls & Slabs'!E193","v":"Added in  WSEC 2018"}]
[49,"2' depth",{"$f":"'Below Grade Walls & Slabs'!F192","v":"R21 Batt + R7 ci, 2' depth"},{"$f":"'Below Grade Walls & Slabs'!E192","v":"Added in  WSEC 2018"},{"$f":"'Below Grade Walls & Slabs'!G192","v":2.9000000000000001E-2},{"$f":"'Below Grade Walls & Slabs'!H192","v":0.68},{"$f":"'Below Grade Walls & Slabs'!E194","v":"Added 2020 from reference"}]
[50,"2' depth",{"$f":"'Below Grade Walls & Slabs'!F193","v":"R21 Batt + R7 ci w/TB, 2' depth"},{"$f":"'Below Grade Walls & Slabs'!E193","v":"Added in  WSEC 2018"},{"$f":"'Below Grade Walls & Slabs'!G193","v":0.03},{"$f":"'Below Grade Walls & Slabs'!H193","v":0.59},{"$f":"'Below Grade Walls & Slabs'!E195","v":"Added 2020 from reference"}]
[51,"2' depth",{"$f":"'Below Grade Walls & Slabs'!F194","v":"R21 Batt + R5 ci R10 Fully Underslab, 2' depth"},{"$f":"'Below Grade Walls & Slabs'!E194","v":"Added 2020 from reference"},{"$f":"'Below Grade Walls & Slabs'!G194","v":3.1E-2},{"$f":"'Below Grade Walls & Slabs'!H194","v":0.35},{"$f":"'Below Grade Walls & Slabs'!E196","v":"Added 2020 from reference"}]
[52,"2' depth",{"$f":"'Below Grade Walls & Slabs'!F195","v":"R25 Batt w/TB, 2' depth"},{"$f":"'Below Grade Walls & Slabs'!E195","v":"Added 2020 from reference"},{"$f":"'Below Grade Walls & Slabs'!G195","v":3.7999999999999999E-2},{"$f":"'Below Grade Walls & Slabs'!H195","v":0.59299999999999997},{"$f":"'Below Grade Walls & Slabs'!E197","v":0}]
[53,"2' depth",{"$f":"'Below Grade Walls & Slabs'!F196","v":"R25 Batt w/TB, R10 Full Underslab, 2' depth"},{"$f":"'Below Grade Walls & Slabs'!E196","v":"Added 2020 from reference"},{"$f":"'Below Grade Walls & Slabs'!G196","v":0.04},{"$f":"'Below Grade Walls & Slabs'!H196","v":0.35},{"$f":"'Below Grade Walls & Slabs'!E198","v":0}]
[54,"3.5' depth",{"$f":"'Below Grade Walls & Slabs'!I167","v":"R0  Uninsulated, 3.5' depth"},{"$f":"'Below Grade Walls & Slabs'!D167","v":"10-1"},{"$f":"'Below Grade Walls & Slabs'!J167","v":0.27100000000000002},{"$f":"'Below Grade Walls & Slabs'!K167","v":0.51},{"$f":"'Below Grade Walls & Slabs'!E167","v":"Updated to WSEC 2018"}]
[55,"3.5' depth",{"$f":"'Below Grade Walls & Slabs'!I168","v":"R10 Foam Ext, 3.5' depth"},{"$f":"'Below Grade Walls & Slabs'!D168","v":"10-1"},{"$f":"'Below Grade Walls & Slabs'!J168","v":7.4999999999999997E-2},{"$f":"'Below Grade Walls & Slabs'!K168","v":0.52},{"$f":"'Below Grade Walls & Slabs'!E168","v":"Updated to WSEC 2018"}]
[56,"3.5' depth",{"$f":"'Below Grade Walls & Slabs'!I169","v":"R10 Foam Ext w/TB, R10 Full Underslab, 3.5' depth"},{"$f":"'Below Grade Walls & Slabs'!D169","v":"Baylon & Kennedy, https://web.ornl.gov/sci/buildings/conf-archive/2007%20B10%20papers/092_Baylon.pdf"},{"$f":"'Below Grade Walls & Slabs'!J169","v":6.4000000000000001E-2},{"$f":"'Below Grade Walls & Slabs'!K169","v":0.32400000000000001},{"$f":"'Below Grade Walls & Slabs'!E169","v":"Added 2020"}]
[57,"3.5' depth",{"$f":"'Below Grade Walls & Slabs'!I170","v":"R11 Batt, 3.5' depth"},{"$f":"'Below Grade Walls & Slabs'!D170","v":"10-1"},{"$f":"'Below Grade Walls & Slabs'!J170","v":5.8000000000000003E-2},{"$f":"'Below Grade Walls & Slabs'!K170","v":0.61},{"$f":"'Below Grade Walls & Slabs'!E170","v":"Updated to WSEC 2018"}]
[58,"3.5' depth",{"$f":"'Below Grade Walls & Slabs'!I171","v":"R11 Batt w/TB, 3.5' depth"},{"$f":"'Below Grade Walls & Slabs'!D171","v":"10-1"},{"$f":"'Below Grade Walls & Slabs'!J171","v":6.0999999999999999E-2},{"$f":"'Below Grade Walls & Slabs'!K171","v":0.55000000000000004},{"$f":"'Below Grade Walls & Slabs'!E171","v":"Updated to WSEC 2018"}]
[59,"3.5' depth",{"$f":"'Below Grade Walls & Slabs'!I172","v":"R11 Batt + R5 ci, 3.5' depth"},{"$f":"'Below Grade Walls & Slabs'!D172","v":"Baylon & Kennedy, https://web.ornl.gov/sci/buildings/conf-archive/2007%20B10%20papers/092_Baylon.pdf"},{"$f":"'Below Grade Walls & Slabs'!J172","v":4.2000000000000003E-2},{"$f":"'Below Grade Walls & Slabs'!K172","v":0.624},{"$f":"'Below Grade Walls & Slabs'!E172","v":"Added 2023 from reference"}]
[60,"3.5' depth",{"$f":"'Below Grade Walls & Slabs'!I173","v":"R11 Batt + R5 ci w/TB, 3.5' depth"},{"$f":"'Below Grade Walls & Slabs'!D173","v":"Baylon & Kennedy, https://web.ornl.gov/sci/buildings/conf-archive/2007%20B10%20papers/092_Baylon.pdf"},{"$f":"'Below Grade Walls & Slabs'!J173","v":4.2999999999999997E-2},{"$f":"'Below Grade Walls & Slabs'!K173","v":0.55300000000000005},{"$f":"'Below Grade Walls & Slabs'!E173","v":"Added 2020 from reference"}]
[61,"3.5' depth",{"$f":"'Below Grade Walls & Slabs'!I174","v":"R11 Batt + R5 ci R10 Fully Underslab, 3.5' depth"},{"$f":"'Below Grade Walls & Slabs'!D174","v":"Baylon & Kennedy, https://web.ornl.gov/sci/buildings/conf-archive/2007%20B10%20papers/092_Baylon.pdf"},{"$f":"'Below Grade Walls & Slabs'!J174","v":4.4999999999999998E-2},{"$f":"'Below Grade Walls & Slabs'!K174","v":0.32900000000000001},{"$f":"'Below Grade Walls & Slabs'!E174","v":"Added 2020 from reference"}]
[62,"3.5' depth",{"$f":"'Below Grade Walls & Slabs'!I175","v":"R12 Foam Ext, 3.5' depth"},{"$f":"'Below Grade Walls & Slabs'!D175","v":"10-1"},{"$f":"'Below Grade Walls & Slabs'!J175","v":5.7000000000000002E-2},{"$f":"'Below Grade Walls & Slabs'!K175","v":0.56999999999999995},{"$f":"'Below Grade Walls & Slabs'!E175","v":"Updated to WSEC 2018"}]
[63,"3.5' depth",{"$f":"'Below Grade Walls & Slabs'!I176","v":"R13 Batt, 3.5' depth"},{"$f":"'Below Grade Walls & Slabs'!D176","v":"WSU"},{"$f":"'Below Grade Walls & Slabs'!J176","v":5.3750000000000006E-2},{"$f":"'Below Grade Walls & Slabs'!K176","v":0.61250000000000004},{"$f":"'Below Grade Walls & Slabs'!E176","v":"Interpolated between R11 and R19"}]
[64,"3.5' depth",{"$f":"'Below Grade Walls & Slabs'!I177","v":"R13 Batt w/TB , 3.5' depth"},{"$f":"'Below Grade Walls & Slabs'!D177","v":"WSU"},{"$f":"'Below Grade Walls & Slabs'!J177","v":5.6250000000000001E-2},{"$f":"'Below Grade Walls & Slabs'!K177","v":0.55000000000000004},{"$f":"'Below Grade Walls & Slabs'!E177","v":"Interpolated between R11 and R19"}]
[65,"3.5' depth",{"$f":"'Below Grade Walls & Slabs'!I178","v":"R13 Batt + R5 ci, 3.5' depth"},{"$f":"'Below Grade Walls & Slabs'!D178","v":"WSU"},{"$f":"'Below Grade Walls & Slabs'!J178","v":3.925E-2},{"$f":"'Below Grade Walls & Slabs'!K178","v":0.62549999999999994},{"$f":"'Below Grade Walls & Slabs'!E178","v":"Interpolated between R11 and R19"}]
[66,"3.5' depth",{"$f":"'Below Grade Walls & Slabs'!I179","v":"R13 Batt + R5 ci R10 Fully Underslab, 3.5' depth"},{"$f":"'Below Grade Walls & Slabs'!D179","v":"WSU"},{"$f":"'Below Grade Walls & Slabs'!J179","v":4.2249999999999996E-2},{"$f":"'Below Grade Walls & Slabs'!K179","v":0.33},{"$f":"'Below Grade Walls & Slabs'!E179","v":"Interpolated between R11 and R19"}]
[null,"3.5' depth",{"$f":"'Below Grade Walls & Slabs'!I180","v":"R15 Batt, 3.5' depth"},{"$f":"'Below Grade Walls & Slabs'!D180","v":"WSU"},{"$f":"'Below Grade Walls & Slabs'!J180","v":4.9500000000000002E-2},{"$f":"'Below Grade Walls & Slabs'!K180","v":0.61499999999999999},{"$f":"'Below Grade Walls & Slabs'!E180","v":"Interpolated between R11 and R19"}]
[{"$f":"A70+1","v":67},"3.5' depth",{"$f":"'Below Grade Walls & Slabs'!I181","v":"R15 Batt w/TB, 3.5' depth"},{"$f":"'Below Grade Walls & Slabs'!D181","v":"WSU"},{"$f":"'Below Grade Walls & Slabs'!J181","v":5.1500000000000004E-2},{"$f":"'Below Grade Walls & Slabs'!K181","v":0.55000000000000004},{"$f":"'Below Grade Walls & Slabs'!E181","v":"Interpolated between R11 and R19"}]
[68,"3.5' depth",{"$f":"'Below Grade Walls & Slabs'!I182","v":"R19 Batt, 3.5' depth"},{"$f":"'Below Grade Walls & Slabs'!D182","v":"10-1"},{"$f":"'Below Grade Walls & Slabs'!J182","v":4.1000000000000002E-2},{"$f":"'Below Grade Walls & Slabs'!K182","v":0.62},{"$f":"'Below Grade Walls & Slabs'!E182","v":"Updated to WSEC 2018"}]
[69,"3.5' depth",{"$f":"'Below Grade Walls & Slabs'!I183","v":"R19 Batt w/TB, 3.5' depth"},{"$f":"'Below Grade Walls & Slabs'!D183","v":"10-1"},{"$f":"'Below Grade Walls & Slabs'!J183","v":4.2000000000000003E-2},{"$f":"'Below Grade Walls & Slabs'!K183","v":0.55000000000000004},{"$f":"'Below Grade Walls & Slabs'!E183","v":"Updated to WSEC 2018"}]
[70,"3.5' depth",{"$f":"'Below Grade Walls & Slabs'!I184","v":"R19 Batt + R5 ci, 3.5' depth"},{"$f":"'Below Grade Walls & Slabs'!D184","v":"Baylon & Kennedy, https://web.ornl.gov/sci/buildings/conf-archive/2007%20B10%20papers/092_Baylon.pdf"},{"$f":"'Below Grade Walls & Slabs'!J184","v":3.1E-2},{"$f":"'Below Grade Walls & Slabs'!K184","v":0.63},{"$f":"'Below Grade Walls & Slabs'!E184","v":"Added 2023 from reference"}]
[71,"3.5' depth",{"$f":"'Below Grade Walls & Slabs'!I185","v":"R19 Batt + R5 ci w/TB, 3.5' depth"},{"$f":"'Below Grade Walls & Slabs'!D185","v":"Baylon & Kennedy, https://web.ornl.gov/sci/buildings/conf-archive/2007%20B10%20papers/092_Baylon.pdf"},{"$f":"'Below Grade Walls & Slabs'!J185","v":3.3000000000000002E-2},{"$f":"'Below Grade Walls & Slabs'!K185","v":0.55800000000000005},{"$f":"'Below Grade Walls & Slabs'!E185","v":"Added 2023 from reference"}]
[72,"3.5' depth",{"$f":"'Below Grade Walls & Slabs'!I186","v":"R19 Batt + R5 ci R10 Fully Underslab, 3.5' depth"},{"$f":"'Below Grade Walls & Slabs'!D186","v":"Baylon & Kennedy, https://web.ornl.gov/sci/buildings/conf-archive/2007%20B10%20papers/092_Baylon.pdf"},{"$f":"'Below Grade Walls & Slabs'!J186","v":3.4000000000000002E-2},{"$f":"'Below Grade Walls & Slabs'!K186","v":0.33300000000000002},{"$f":"'Below Grade Walls & Slabs'!E186","v":"Added 2023 from reference"}]
[73,"3.5' depth",{"$f":"'Below Grade Walls & Slabs'!I187","v":"R20 Foam Ext w/TB, R10 Full Underslab, 3.5' depth"},{"$f":"'Below Grade Walls & Slabs'!D187","v":"Baylon & Kennedy, https://web.ornl.gov/sci/buildings/conf-archive/2007%20B10%20papers/092_Baylon.pdf"},{"$f":"'Below Grade Walls & Slabs'!J187","v":3.7999999999999999E-2},{"$f":"'Below Grade Walls & Slabs'!K187","v":0.33100000000000002},{"$f":"'Below Grade Walls & Slabs'!E187","v":"Added 2020 from reference"}]
[74,"3.5' depth",{"$f":"'Below Grade Walls & Slabs'!I188","v":"R21 Batt, 3.5' depth"},{"$f":"'Below Grade Walls & Slabs'!D188","v":"WSU"},{"$f":"'Below Grade Walls & Slabs'!J188","v":3.7999999999999999E-2},{"$f":"'Below Grade Walls & Slabs'!K188","v":0.63},{"$f":"'Below Grade Walls & Slabs'!E188","v":"Updated to WSEC 2018"}]
[75,"3.5' depth",{"$f":"'Below Grade Walls & Slabs'!I189","v":"R21 Batt w/TB, 3.5' depth"},{"$f":"'Below Grade Walls & Slabs'!D189","v":"WSU"},{"$f":"'Below Grade Walls & Slabs'!J189","v":0.04},{"$f":"'Below Grade Walls & Slabs'!K189","v":0.56000000000000005},{"$f":"'Below Grade Walls & Slabs'!E189","v":"Updated to WSEC 2018"}]
[76,"3.5' depth",{"$f":"'Below Grade Walls & Slabs'!I190","v":"R21 Batt + R5 ci, 3.5' depth"},{"$f":"'Below Grade Walls & Slabs'!D190","v":"10-1"},{"$f":"'Below Grade Walls & Slabs'!J190","v":0.03},{"$f":"'Below Grade Walls & Slabs'!K190","v":0.63200000000000001},{"$f":"'Below Grade Walls & Slabs'!E190","v":"Added in  WSEC 2018"}]
[77,"3.5' depth",{"$f":"'Below Grade Walls & Slabs'!I191","v":"R21 Batt + R5 ci w/TB, 3.5' depth"},{"$f":"'Below Grade Walls & Slabs'!D191","v":"10-1"},{"$f":"'Below Grade Walls & Slabs'!J191","v":3.1E-2},{"$f":"'Below Grade Walls & Slabs'!K191","v":0.56000000000000005},{"$f":"'Below Grade Walls & Slabs'!E191","v":"Added in  WSEC 2018"}]
[78,"3.5' depth",{"$f":"'Below Grade Walls & Slabs'!I192","v":"R21 Batt + R7 ci, 3.5' depth"},{"$f":"'Below Grade Walls & Slabs'!D192","v":"10-1"},{"$f":"'Below Grade Walls & Slabs'!J192","v":2.7E-2},{"$f":"'Below Grade Walls & Slabs'!K192","v":0.63},{"$f":"'Below Grade Walls & Slabs'!E192","v":"Added in  WSEC 2018"}]
[79,"3.5' depth",{"$f":"'Below Grade Walls & Slabs'!I193","v":"R21 Batt + R7 ci w/TB, 3.5' depth"},{"$f":"'Below Grade Walls & Slabs'!D193","v":"10-1"},{"$f":"'Below Grade Walls & Slabs'!J193","v":2.9000000000000001E-2},{"$f":"'Below Grade Walls & Slabs'!K193","v":0.56000000000000005},{"$f":"'Below Grade Walls & Slabs'!E193","v":"Added in  WSEC 2018"}]
[80,"3.5' depth",{"$f":"'Below Grade Walls & Slabs'!I194","v":"R21 Batt + R5 ci R10 Fully Underslab, 3.5' depth"},{"$f":"'Below Grade Walls & Slabs'!D194","v":"Baylon & Kennedy, https://web.ornl.gov/sci/buildings/conf-archive/2007%20B10%20papers/092_Baylon.pdf"},{"$f":"'Below Grade Walls & Slabs'!J194","v":3.2000000000000001E-2},{"$f":"'Below Grade Walls & Slabs'!K194","v":0.33300000000000002},{"$f":"'Below Grade Walls & Slabs'!E194","v":"Added 2020 from reference"}]
[81,"3.5' depth",{"$f":"'Below Grade Walls & Slabs'!I195","v":"R25 Batt w/TB, 3.5' depth"},{"$f":"'Below Grade Walls & Slabs'!D195","v":"Baylon & Kennedy, https://web.ornl.gov/sci/buildings/conf-archive/2007%20B10%20papers/092_Baylon.pdf"},{"$f":"'Below Grade Walls & Slabs'!J195","v":3.5999999999999997E-2},{"$f":"'Below Grade Walls & Slabs'!K195","v":0.55700000000000005},{"$f":"'Below Grade Walls & Slabs'!E195","v":"Added 2020 from reference"}]
[82,"3.5' depth",{"$f":"'Below Grade Walls & Slabs'!I196","v":"R25 Batt w/TB, R10 Full Underslab, 3.5' depth"},{"$f":"'Below Grade Walls & Slabs'!D196","v":"Baylon & Kennedy, https://web.ornl.gov/sci/buildings/conf-archive/2007%20B10%20papers/092_Baylon.pdf"},{"$f":"'Below Grade Walls & Slabs'!J196","v":3.7999999999999999E-2},{"$f":"'Below Grade Walls & Slabs'!K196","v":0.33100000000000002},{"$f":"'Below Grade Walls & Slabs'!E196","v":"Added 2020 from reference"}]
[83,"7' depth",{"$f":"'Below Grade Walls & Slabs'!L167","v":"R0  Uninsulated, 7' depth"},{"$f":"'Below Grade Walls & Slabs'!D167","v":"10-1"},{"$f":"'Below Grade Walls & Slabs'!M167","v":0.185},{"$f":"'Below Grade Walls & Slabs'!N167","v":0.43},{"$f":"'Below Grade Walls & Slabs'!E167","v":"Updated to WSEC 2018"}]
[84,"7' depth",{"$f":"'Below Grade Walls & Slabs'!L168","v":"R10 Foam Ext, 7' depth"},{"$f":"'Below Grade Walls & Slabs'!D168","v":"10-1"},{"$f":"'Below Grade Walls & Slabs'!M168","v":5.8000000000000003E-2},{"$f":"'Below Grade Walls & Slabs'!N168","v":0.47},{"$f":"'Below Grade Walls & Slabs'!E168","v":"Updated to WSEC 2018"}]
[null,"7' depth",{"$f":"'Below Grade Walls & Slabs'!L169","v":"R10 Foam Ext w/TB, R10 Full Underslab, 7' depth"},{"$f":"'Below Grade Walls & Slabs'!D169","v":"Baylon & Kennedy, https://web.ornl.gov/sci/buildings/conf-archive/2007%20B10%20papers/092_Baylon.pdf"},{"$f":"'Below Grade Walls & Slabs'!M169","v":5.5E-2},{"$f":"'Below Grade Walls & Slabs'!N169","v":0.29299999999999998},{"$f":"'Below Grade Walls & Slabs'!E169","v":"Added 2020"}]
[{"$f":"A89+1","v":85},"7' depth",{"$f":"'Below Grade Walls & Slabs'!L170","v":"R11 Batt, 7' depth"},{"$f":"'Below Grade Walls & Slabs'!D170","v":"10-1"},{"$f":"'Below Grade Walls & Slabs'!M170","v":5.0999999999999997E-2},{"$f":"'Below Grade Walls & Slabs'!N170","v":0.54100000000000004},{"$f":"'Below Grade Walls & Slabs'!E170","v":"Updated to WSEC 2018"}]
[86,"7' depth",{"$f":"'Below Grade Walls & Slabs'!L171","v":"R11 Batt w/TB, 7' depth"},{"$f":"'Below Grade Walls & Slabs'!D171","v":"10-1"},{"$f":"'Below Grade Walls & Slabs'!M171","v":5.2999999999999999E-2},{"$f":"'Below Grade Walls & Slabs'!N171","v":0.49},{"$f":"'Below Grade Walls & Slabs'!E171","v":"Updated to WSEC 2018"}]
[87,"7' depth",{"$f":"'Below Grade Walls & Slabs'!L172","v":"R11 Batt + R5 ci, 7' depth"},{"$f":"'Below Grade Walls & Slabs'!D172","v":"Baylon & Kennedy, https://web.ornl.gov/sci/buildings/conf-archive/2007%20B10%20papers/092_Baylon.pdf"},{"$f":"'Below Grade Walls & Slabs'!M172","v":3.6999999999999998E-2},{"$f":"'Below Grade Walls & Slabs'!N172","v":0.55300000000000005},{"$f":"'Below Grade Walls & Slabs'!E172","v":"Added 2023 from reference"}]
[88,"7' depth",{"$f":"'Below Grade Walls & Slabs'!L173","v":"R11 Batt + R5 ci w/TB, 7' depth"},{"$f":"'Below Grade Walls & Slabs'!D173","v":"Baylon & Kennedy, https://web.ornl.gov/sci/buildings/conf-archive/2007%20B10%20papers/092_Baylon.pdf"},{"$f":"'Below Grade Walls & Slabs'!M173","v":3.7999999999999999E-2},{"$f":"'Below Grade Walls & Slabs'!N173","v":0.499},{"$f":"'Below Grade Walls & Slabs'!E173","v":"Added 2020 from reference"}]
[89,"7' depth",{"$f":"'Below Grade Walls & Slabs'!L174","v":"R11 Batt + R5 ci R10 Fully Underslab, 7' depth"},{"$f":"'Below Grade Walls & Slabs'!D174","v":"Baylon & Kennedy, https://web.ornl.gov/sci/buildings/conf-archive/2007%20B10%20papers/092_Baylon.pdf"},{"$f":"'Below Grade Walls & Slabs'!M174","v":0.04},{"$f":"'Below Grade Walls & Slabs'!N174","v":0.30099999999999999},{"$f":"'Below Grade Walls & Slabs'!E174","v":"Added 2020 from reference"}]
[90,"7' depth",{"$f":"'Below Grade Walls & Slabs'!L175","v":"R12 Foam Ext, 7' depth"},{"$f":"'Below Grade Walls & Slabs'!D175","v":"10-1"},{"$f":"'Below Grade Walls & Slabs'!M175","v":0.05},{"$f":"'Below Grade Walls & Slabs'!N175","v":0.42},{"$f":"'Below Grade Walls & Slabs'!E175","v":"Updated to WSEC 2018"}]
[91,"7' depth",{"$f":"'Below Grade Walls & Slabs'!L176","v":"R13 Batt, 7' depth"},{"$f":"'Below Grade Walls & Slabs'!D176","v":"WSU"},{"$f":"'Below Grade Walls & Slabs'!M176","v":4.725E-2},{"$f":"'Below Grade Walls & Slabs'!N176","v":0.54075000000000006},{"$f":"'Below Grade Walls & Slabs'!E176","v":"Interpolated between R11 and R19"}]
[92,"7' depth",{"$f":"'Below Grade Walls & Slabs'!L177","v":"R13 Batt w/TB , 7' depth"},{"$f":"'Below Grade Walls & Slabs'!D177","v":"WSU"},{"$f":"'Below Grade Walls & Slabs'!M177","v":4.9000000000000002E-2},{"$f":"'Below Grade Walls & Slabs'!N177","v":0.49249999999999999},{"$f":"'Below Grade Walls & Slabs'!E177","v":"Interpolated between R11 and R19"}]
[93,"7' depth",{"$f":"'Below Grade Walls & Slabs'!L178","v":"R13 Batt + R5 ci, 7' depth"},{"$f":"'Below Grade Walls & Slabs'!D178","v":"WSU"},{"$f":"'Below Grade Walls & Slabs'!M178","v":3.4749999999999996E-2},{"$f":"'Below Grade Walls & Slabs'!N178","v":0.55549999999999999},{"$f":"'Below Grade Walls & Slabs'!E178","v":"Interpolated between R11 and R19"}]
[94,"7' depth",{"$f":"'Below Grade Walls & Slabs'!L179","v":"R13 Batt + R5 ci R10 Fully Underslab, 7' depth"},{"$f":"'Below Grade Walls & Slabs'!D179","v":"WSU"},{"$f":"'Below Grade Walls & Slabs'!M179","v":3.7749999999999999E-2},{"$f":"'Below Grade Walls & Slabs'!N179","v":0.30249999999999999},{"$f":"'Below Grade Walls & Slabs'!E179","v":"Interpolated between R11 and R19"}]
[null,"7' depth",{"$f":"'Below Grade Walls & Slabs'!L180","v":"R15 Batt, 7' depth"},{"$f":"'Below Grade Walls & Slabs'!D180","v":"WSU"},{"$f":"'Below Grade Walls & Slabs'!M180","v":4.3499999999999997E-2},{"$f":"'Below Grade Walls & Slabs'!N180","v":0.54049999999999998},{"$f":"'Below Grade Walls & Slabs'!E180","v":"Interpolated between R11 and R19"}]
[{"$f":"A100+1","v":95},"7' depth",{"$f":"'Below Grade Walls & Slabs'!L181","v":"R15 Batt w/TB, 7' depth"},{"$f":"'Below Grade Walls & Slabs'!D181","v":"WSU"},{"$f":"'Below Grade Walls & Slabs'!M181","v":4.4999999999999998E-2},{"$f":"'Below Grade Walls & Slabs'!N181","v":0.495},{"$f":"'Below Grade Walls & Slabs'!E181","v":"Interpolated between R11 and R19"}]
[96,"7' depth",{"$f":"'Below Grade Walls & Slabs'!L182","v":"R19 Batt, 7' depth"},{"$f":"'Below Grade Walls & Slabs'!D182","v":"10-1"},{"$f":"'Below Grade Walls & Slabs'!M182","v":3.5999999999999997E-2},{"$f":"'Below Grade Walls & Slabs'!N182","v":0.54},{"$f":"'Below Grade Walls & Slabs'!E182","v":"Updated to WSEC 2018"}]
[97,"7' depth",{"$f":"'Below Grade Walls & Slabs'!L183","v":"R19 Batt w/TB, 7' depth"},{"$f":"'Below Grade Walls & Slabs'!D183","v":"10-1"},{"$f":"'Below Grade Walls & Slabs'!M183","v":3.6999999999999998E-2},{"$f":"'Below Grade Walls & Slabs'!N183","v":0.5},{"$f":"'Below Grade Walls & Slabs'!E183","v":"Updated to WSEC 2018"}]
[98,"7' depth",{"$f":"'Below Grade Walls & Slabs'!L184","v":"R19 Batt + R5 ci, 7' depth"},{"$f":"'Below Grade Walls & Slabs'!D184","v":"Baylon & Kennedy, https://web.ornl.gov/sci/buildings/conf-archive/2007%20B10%20papers/092_Baylon.pdf"},{"$f":"'Below Grade Walls & Slabs'!M184","v":2.8000000000000001E-2},{"$f":"'Below Grade Walls & Slabs'!N184","v":0.56299999999999994},{"$f":"'Below Grade Walls & Slabs'!E184","v":"Added 2023 from reference"}]
[99,"7' depth",{"$f":"'Below Grade Walls & Slabs'!L185","v":"R19 Batt + R5 ci w/TB, 7' depth"},{"$f":"'Below Grade Walls & Slabs'!D185","v":"Baylon & Kennedy, https://web.ornl.gov/sci/buildings/conf-archive/2007%20B10%20papers/092_Baylon.pdf"},{"$f":"'Below Grade Walls & Slabs'!M185","v":2.9000000000000001E-2},{"$f":"'Below Grade Walls & Slabs'!N185","v":0.50700000000000001},{"$f":"'Below Grade Walls & Slabs'!E185","v":"Added 2023 from reference"}]
[100,"7' depth",{"$f":"'Below Grade Walls & Slabs'!L186","v":"R19 Batt + R5 ci R10 Fully Underslab, 7' depth"},{"$f":"'Below Grade Walls & Slabs'!D186","v":"Baylon & Kennedy, https://web.ornl.gov/sci/buildings/conf-archive/2007%20B10%20papers/092_Baylon.pdf"},{"$f":"'Below Grade Walls & Slabs'!M186","v":3.1E-2},{"$f":"'Below Grade Walls & Slabs'!N186","v":0.307},{"$f":"'Below Grade Walls & Slabs'!E186","v":"Added 2023 from reference"}]
[null,"7' depth",{"$f":"'Below Grade Walls & Slabs'!L187","v":"R20 Foam Ext w/TB, R10 Full Underslab, 7' depth"},{"$f":"'Below Grade Walls & Slabs'!D187","v":"Baylon & Kennedy, https://web.ornl.gov/sci/buildings/conf-archive/2007%20B10%20papers/092_Baylon.pdf"},{"$f":"'Below Grade Walls & Slabs'!M187","v":3.4000000000000002E-2},{"$f":"'Below Grade Walls & Slabs'!N187","v":0.30399999999999999},{"$f":"'Below Grade Walls & Slabs'!E187","v":"Added 2020 from reference"}]
[{"$f":"A107+1","v":101},"7' depth",{"$f":"'Below Grade Walls & Slabs'!L188","v":"R21 Batt, 7' depth"},{"$f":"'Below Grade Walls & Slabs'!D188","v":"WSU"},{"$f":"'Below Grade Walls & Slabs'!M188","v":3.5000000000000003E-2},{"$f":"'Below Grade Walls & Slabs'!N188","v":0.56000000000000005},{"$f":"'Below Grade Walls & Slabs'!E188","v":"Updated to WSEC 2018"}]
[102,"7' depth",{"$f":"'Below Grade Walls & Slabs'!L189","v":"R21 Batt w/TB, 7' depth"},{"$f":"'Below Grade Walls & Slabs'!D189","v":"WSU"},{"$f":"'Below Grade Walls & Slabs'!M189","v":3.5000000000000003E-2},{"$f":"'Below Grade Walls & Slabs'!N189","v":0.5},{"$f":"'Below Grade Walls & Slabs'!E189","v":"Updated to WSEC 2018"}]
[103,"7' depth",{"$f":"'Below Grade Walls & Slabs'!L190","v":"R21 Batt + R5 ci, 7' depth"},{"$f":"'Below Grade Walls & Slabs'!D190","v":"10-1"},{"$f":"'Below Grade Walls & Slabs'!M190","v":2.7E-2},{"$f":"'Below Grade Walls & Slabs'!N190","v":0.56000000000000005},{"$f":"'Below Grade Walls & Slabs'!E190","v":"Added in  WSEC 2018"}]
[104,"7' depth",{"$f":"'Below Grade Walls & Slabs'!L191","v":"R21 Batt + R5 ci w/TB, 7' depth"},{"$f":"'Below Grade Walls & Slabs'!D191","v":"10-1"},{"$f":"'Below Grade Walls & Slabs'!M191","v":2.8000000000000001E-2},{"$f":"'Below Grade Walls & Slabs'!N191","v":0.51},{"$f":"'Below Grade Walls & Slabs'!E191","v":"Added in  WSEC 2018"}]
[105,"7' depth",{"$f":"'Below Grade Walls & Slabs'!L192","v":"R21 Batt + R7 ci, 7' depth"},{"$f":"'Below Grade Walls & Slabs'!D192","v":"10-1"},{"$f":"'Below Grade Walls & Slabs'!M192","v":2.5000000000000001E-2},{"$f":"'Below Grade Walls & Slabs'!N192","v":0.56999999999999995},{"$f":"'Below Grade Walls & Slabs'!E192","v":"Added in  WSEC 2018"}]
[106,"7' depth",{"$f":"'Below Grade Walls & Slabs'!L193","v":"R21 Batt + R7 ci w/TB, 7' depth"},{"$f":"'Below Grade Walls & Slabs'!D193","v":"10-1"},{"$f":"'Below Grade Walls & Slabs'!M193","v":2.5999999999999999E-2},{"$f":"'Below Grade Walls & Slabs'!N193","v":0.56999999999999995},{"$f":"'Below Grade Walls & Slabs'!E193","v":"Added in  WSEC 2018"}]
[107,"7' depth",{"$f":"'Below Grade Walls & Slabs'!L194","v":"R21 Batt + R5 ci R10 Fully Underslab, 7' depth"},{"$f":"'Below Grade Walls & Slabs'!D194","v":"Baylon & Kennedy, https://web.ornl.gov/sci/buildings/conf-archive/2007%20B10%20papers/092_Baylon.pdf"},{"$f":"'Below Grade Walls & Slabs'!M194","v":2.9000000000000001E-2},{"$f":"'Below Grade Walls & Slabs'!N194","v":0.307},{"$f":"'Below Grade Walls & Slabs'!E194","v":"Added 2020 from reference"}]
[108,"7' depth",{"$f":"'Below Grade Walls & Slabs'!L195","v":"R25 Batt w/TB, 7' depth"},{"$f":"'Below Grade Walls & Slabs'!D195","v":"Baylon & Kennedy, https://web.ornl.gov/sci/buildings/conf-archive/2007%20B10%20papers/092_Baylon.pdf"},{"$f":"'Below Grade Walls & Slabs'!M195","v":3.2000000000000001E-2},{"$f":"'Below Grade Walls & Slabs'!N195","v":0.505},{"$f":"'Below Grade Walls & Slabs'!E195","v":"Added 2020 from reference"}]
[109,"7' depth",{"$f":"'Below Grade Walls & Slabs'!L196","v":"R25 Batt w/TB, R10 Full Underslab, 7' depth"},{"$f":"'Below Grade Walls & Slabs'!D196","v":"Baylon & Kennedy, https://web.ornl.gov/sci/buildings/conf-archive/2007%20B10%20papers/092_Baylon.pdf"},{"$f":"'Below Grade Walls & Slabs'!M196","v":3.4000000000000002E-2},{"$f":"'Below Grade Walls & Slabs'!N196","v":0.30399999999999999},{"$f":"'Below Grade Walls & Slabs'!E196","v":"Added 2020 from reference"}]
[110]
[{"$f":"A118+1","v":111},"Depth",{"$f":"'Flat-Vaulted Ceilings'!$B$339","v":"== Custom Entries per WSEC R402.1.5 U-factor Reference and Calculations ========  "},null,"Wall U","Slab F","Notes",{"$f":"'Flat-Vaulted Ceilings'!$F$339","v":"Your entries appear at bottom of drowdown menus on \"Group R\" tab"}]
[112,null,null,"Custom",null,null,null,{"$f":"IF(AND(C121<>\"\",C120=\"\"),\"Don't skip lines\",IF(AND(OR(F120=\"\",E120=\"\"),C120<>\"\"),\"Enter U- and F-values\",IF(AND(OR(F120<>\"\",E120<>\"\"),C120=\"\"),\"Enter Description\",\"\")))","v":""}]
[113,null,null,"Custom",null,null,null,""]
[114,null,null,"Custom",null,null,null,""]
[115,null,null,"Custom",null,null,null,""]
[116,null,null,"Custom",null,null,null,""]
[117,null,null,"Custom",null,null,null,""]
[118,null,null,"Custom",null,null,null,""]
[119,null,null,"Custom",null,null,null,""]
[]
[]
[]
[]
[]
[]
[]
[]
[]
[]
[]
[]
[]
[]
[]
[]
[]
[]
[]
[]
[]
[]
[]
[null,null,"CALCULATION AREA"]
[]
[]
[null,null,"If you rearrange, add or delete rows below  -- be sure to make corresponding changes to the six areas above. "]
[]
[null,null,"DropDown_BelowGradeSlab",null,null,"Component Description","Wall U","Slab F","Component Description","Wall U","Slab F","Component Description","Wall U","Slab F"]
[1,null,null,"Reference","Notes","2' depth",null,null,"3.5' depth",null,null,"7' depth"]
[{"$f":"A157+1","v":2},null,"=== Most Frequently Used ========= "]
[3,null,{"$f":"C167","v":"R0  Uninsulated"},{"$f":"VLOOKUP($C159,$C$167:$E$206,2,FALSE)","v":"10-1"},{"$f":"VLOOKUP($C159,$C$167:$E$206,3,FALSE)","v":"Updated to WSEC 2018"},{"$f":"CONCATENATE($C159,\", \",F$157)","v":"R0  Uninsulated, 2' depth"},{"$f":"VLOOKUP($F159,$F$167:$H$206,2,FALSE)","v":0.33100000000000002},{"$f":"VLOOKUP($F159,$F$167:$H$206,3,FALSE)","v":0.57999999999999996},{"$f":"CONCATENATE($C159,\", \",I$157)","v":"R0  Uninsulated, 3.5' depth"},{"$f":"VLOOKUP($I159,$I$167:$K$206,2,FALSE)","v":0.27100000000000002},{"$f":"VLOOKUP($I159,$I$167:$K$206,3,FALSE)","v":0.51},{"$f":"CONCATENATE($C159,\", \",L$157)","v":"R0  Uninsulated, 7' depth"},{"$f":"VLOOKUP($L159,$L$167:$N$206,2,FALSE)","v":0.185},{"$f":"VLOOKUP($L159,$L$167:$N$206,3,FALSE)","v":0.43}]
[4,null,{"$f":"C168","v":"R10 Foam Ext"},"10-1","Updated to WSEC 2018","R10 Foam Ext, 2' depth",8.8999999999999996E-2,0.56000000000000005,"R10 Foam Ext, 3.5' depth",7.4999999999999997E-2,0.52,"R10 Foam Ext, 7' depth",5.8000000000000003E-2,0.47]
[5,null,{"$f":"C170","v":"R11 Batt"},"10-1","Updated to WSEC 2018","R11 Batt, 2' depth",6.3E-2,0.67,"R11 Batt, 3.5' depth",5.8000000000000003E-2,0.61,"R11 Batt, 7' depth",5.0999999999999997E-2,0.54100000000000004]
[6,null,{"$f":"C175","v":"R12 Foam Ext"},"10-1","Updated to WSEC 2018","R12 Foam Ext, 2' depth",0.61,0.6,"R12 Foam Ext, 3.5' depth",5.7000000000000002E-2,0.56999999999999995,"R12 Foam Ext, 7' depth",0.05,0.42]
[{"$f":"A162+1","v":7},null,{"$f":"C169","v":"R10 Foam Ext w/TB, R10 Full Underslab"},"Baylon & Kennedy, https://web.ornl.gov/sci/buildings/conf-archive/2007%20B10%20papers/092_Baylon.pdf","Added 2020","R10 Foam Ext w/TB, R10 Full Underslab, 2' depth",6.8000000000000005E-2,0.34499999999999997,"R10 Foam Ext w/TB, R10 Full Underslab, 3.5' depth",6.4000000000000001E-2,0.32400000000000001,"R10 Foam Ext w/TB, R10 Full Underslab, 7' depth",5.5E-2,0.29299999999999998]
[8,null,{"$f":"C187","v":"R20 Foam Ext w/TB, R10 Full Underslab"},"Baylon & Kennedy, https://web.ornl.gov/sci/buildings/conf-archive/2007%20B10%20papers/092_Baylon.pdf","Added 2020 from reference","R20 Foam Ext w/TB, R10 Full Underslab, 2' depth",0.04,0.35,"R20 Foam Ext w/TB, R10 Full Underslab, 3.5' depth",3.7999999999999999E-2,0.33100000000000002,"R20 Foam Ext w/TB, R10 Full Underslab, 7' depth",3.4000000000000002E-2,0.30399999999999999]
[9,null,{"$f":"C189","v":"R21 Batt w/TB"},"WSU","Updated to WSEC 2018","R21 Batt w/TB, 2' depth",4.2000000000000003E-2,0.59,"R21 Batt w/TB, 3.5' depth",0.04,0.56000000000000005,"R21 Batt w/TB, 7' depth",3.5000000000000003E-2,0.5]
[10,null,"============================"]
[11,null,"R0  Uninsulated","10-1","Updated to WSEC 2018",{"$f":"CONCATENATE($C167,\", \",F$157)","v":"R0  Uninsulated, 2' depth"},0.33100000000000002,0.57999999999999996,{"$f":"CONCATENATE($C167,\", \",I$157)","v":"R0  Uninsulated, 3.5' depth"},0.27100000000000002,0.51,{"$f":"CONCATENATE($C167,\", \",L$157)","v":"R0  Uninsulated, 7' depth"},0.185,0.43]
[12,null,"R10 Foam Ext","10-1","Updated to WSEC 2018","R10 Foam Ext, 2' depth",8.8999999999999996E-2,0.56000000000000005,"R10 Foam Ext, 3.5' depth",7.4999999999999997E-2,0.52,"R10 Foam Ext, 7' depth",5.8000000000000003E-2,0.47]
[13,null,"R10 Foam Ext w/TB, R10 Full Underslab","Baylon & Kennedy, https://web.ornl.gov/sci/buildings/conf-archive/2007%20B10%20papers/092_Baylon.pdf","Added 2020","R10 Foam Ext w/TB, R10 Full Underslab, 2' depth",6.8000000000000005E-2,0.34499999999999997,"R10 Foam Ext w/TB, R10 Full Underslab, 3.5' depth",6.4000000000000001E-2,0.32400000000000001,"R10 Foam Ext w/TB, R10 Full Underslab, 7' depth",5.5E-2,0.29299999999999998]
[14,null,"R11 Batt","10-1","Updated to WSEC 2018","R11 Batt, 2' depth",6.3E-2,0.67,"R11 Batt, 3.5' depth",5.8000000000000003E-2,0.61,"R11 Batt, 7' depth",5.0999999999999997E-2,0.54100000000000004]
[15,null,"R11 Batt w/TB","10-1","Updated to WSEC 2018","R11 Batt w/TB, 2' depth",6.5000000000000002E-2,0.59,"R11 Batt w/TB, 3.5' depth",6.0999999999999999E-2,0.55000000000000004,"R11 Batt w/TB, 7' depth",5.2999999999999999E-2,0.49]
[16,null,"R11 Batt + R5 ci","Baylon & Kennedy, https://web.ornl.gov/sci/buildings/conf-archive/2007%20B10%20papers/092_Baylon.pdf","Added 2023 from reference","R11 Batt + R5 ci, 2' depth",4.3999999999999997E-2,0.67700000000000005,"R11 Batt + R5 ci, 3.5' depth",4.2000000000000003E-2,0.624,"R11 Batt + R5 ci, 7' depth",3.6999999999999998E-2,0.55300000000000005]
[17,null,"R11 Batt + R5 ci w/TB","Baylon & Kennedy, https://web.ornl.gov/sci/buildings/conf-archive/2007%20B10%20papers/092_Baylon.pdf","Added 2020 from reference","R11 Batt + R5 ci w/TB, 2' depth",4.5999999999999999E-2,0.59,"R11 Batt + R5 ci w/TB, 3.5' depth",4.2999999999999997E-2,0.55300000000000005,"R11 Batt + R5 ci w/TB, 7' depth",3.7999999999999999E-2,0.499]
[18,null,"R11 Batt + R5 ci R10 Fully Underslab","Baylon & Kennedy, https://web.ornl.gov/sci/buildings/conf-archive/2007%20B10%20papers/092_Baylon.pdf","Added 2020 from reference","R11 Batt + R5 ci R10 Fully Underslab, 2' depth",4.8000000000000001E-2,0.34799999999999998,"R11 Batt + R5 ci R10 Fully Underslab, 3.5' depth",4.4999999999999998E-2,0.32900000000000001,"R11 Batt + R5 ci R10 Fully Underslab, 7' depth",0.04,0.30099999999999999]
[19,null,"R12 Foam Ext","10-1","Updated to WSEC 2018","R12 Foam Ext, 2' depth",0.61,0.6,"R12 Foam Ext, 3.5' depth",5.7000000000000002E-2,0.56999999999999995,"R12 Foam Ext, 7' depth",0.05,0.42]
[20,null,"R13 Batt","WSU","Interpolated between R11 and R19","R13 Batt, 2' depth",{"$f":"(13-11)/(19-11)*(G182-G170)+G170","v":5.7750000000000003E-2},0.6725000000000001,"R13 Batt, 3.5' depth",{"$f":"(13-11)/(19-11)*(J182-J170)+J170","v":5.3750000000000006E-2},0.61250000000000004,"R13 Batt, 7' depth",{"$f":"(13-11)/(19-11)*(M182-M170)+M170","v":4.725E-2},0.54075000000000006]
[21,null,"R13 Batt w/TB ","WSU","Interpolated between R11 and R19","R13 Batt w/TB , 2' depth",0.06,0.59,"R13 Batt w/TB , 3.5' depth",5.6250000000000001E-2,0.55000000000000004,"R13 Batt w/TB , 7' depth",4.9000000000000002E-2,0.49249999999999999]
[22,null,"R13 Batt + R5 ci","WSU","Interpolated between R11 and R19","R13 Batt + R5 ci, 2' depth",4.1249999999999995E-2,0.67825000000000002,"R13 Batt + R5 ci, 3.5' depth",3.925E-2,0.62549999999999994,"R13 Batt + R5 ci, 7' depth",3.4749999999999996E-2,0.55549999999999999]
[null,null,"R13 Batt + R5 ci R10 Fully Underslab","WSU","Interpolated between R11 and R19","R13 Batt + R5 ci R10 Fully Underslab, 2' depth",{"$f":"(13-11)/(19-11)*(G186-G174)+G174","v":4.4999999999999998E-2},{"$f":"(13-11)/(19-11)*(H186-H174)+H174","v":0.34849999999999998},"R13 Batt + R5 ci R10 Fully Underslab, 3.5' depth",{"$f":"(13-11)/(19-11)*(J186-J174)+J174","v":4.2249999999999996E-2},{"$f":"(13-11)/(19-11)*(K186-K174)+K174","v":0.33},"R13 Batt + R5 ci R10 Fully Underslab, 7' depth",{"$f":"(13-11)/(19-11)*(M186-M174)+M174","v":3.7749999999999999E-2},{"$f":"(13-11)/(19-11)*(N186-N174)+N174","v":0.30249999999999999}]
[{"$f":"A178+1","v":23},null,"R15 Batt","WSU","Interpolated between R11 and R19","R15 Batt, 2' depth",{"$f":"G170*0.5+G182*0.5","v":5.2500000000000005E-2},{"$f":"H170*0.5+H182*0.5","v":0.67500000000000004},"R15 Batt, 3.5' depth",{"$f":"J170*0.5+J182*0.5","v":4.9500000000000002E-2},{"$f":"K170*0.5+K182*0.5","v":0.61499999999999999},"R15 Batt, 7' depth",{"$f":"M170*0.5+M182*0.5","v":4.3499999999999997E-2},{"$f":"N170*0.5+N182*0.5","v":0.54049999999999998}]
[24,null,"R15 Batt w/TB","WSU","Interpolated between R11 and R19","R15 Batt w/TB, 2' depth",{"$f":"G171*0.5+G183*0.5","v":5.5E-2},{"$f":"H171*0.5+H183*0.5","v":0.59},"R15 Batt w/TB, 3.5' depth",{"$f":"J171*0.5+J183*0.5","v":5.1500000000000004E-2},{"$f":"K171*0.5+K183*0.5","v":0.55000000000000004},"R15 Batt w/TB, 7' depth",{"$f":"M171*0.5+M183*0.5","v":4.4999999999999998E-2},{"$f":"N171*0.5+N183*0.5","v":0.495}]
[25,null,"R19 Batt","10-1","Updated to WSEC 2018","R19 Batt, 2' depth",4.2000000000000003E-2,0.68,"R19 Batt, 3.5' depth",4.1000000000000002E-2,0.62,"R19 Batt, 7' depth",3.5999999999999997E-2,0.54]
[26,null,"R19 Batt w/TB","10-1","Updated to WSEC 2018","R19 Batt w/TB, 2' depth",4.4999999999999998E-2,0.59,"R19 Batt w/TB, 3.5' depth",4.2000000000000003E-2,0.55000000000000004,"R19 Batt w/TB, 7' depth",3.6999999999999998E-2,0.5]
[27,null,"R19 Batt + R5 ci","Baylon & Kennedy, https://web.ornl.gov/sci/buildings/conf-archive/2007%20B10%20papers/092_Baylon.pdf","Added 2023 from reference","R19 Batt + R5 ci, 2' depth",3.3000000000000002E-2,0.68200000000000005,"R19 Batt + R5 ci, 3.5' depth",3.1E-2,0.63,"R19 Batt + R5 ci, 7' depth",2.8000000000000001E-2,0.56299999999999994]
[28,null,"R19 Batt + R5 ci w/TB","Baylon & Kennedy, https://web.ornl.gov/sci/buildings/conf-archive/2007%20B10%20papers/092_Baylon.pdf","Added 2023 from reference","R19 Batt + R5 ci w/TB, 2' depth",3.4000000000000002E-2,0.59399999999999997,"R19 Batt + R5 ci w/TB, 3.5' depth",3.3000000000000002E-2,0.55800000000000005,"R19 Batt + R5 ci w/TB, 7' depth",2.9000000000000001E-2,0.50700000000000001]
[null,null,"R19 Batt + R5 ci R10 Fully Underslab","Baylon & Kennedy, https://web.ornl.gov/sci/buildings/conf-archive/2007%20B10%20papers/092_Baylon.pdf","Added 2023 from reference","R19 Batt + R5 ci R10 Fully Underslab, 2' depth",3.5999999999999997E-2,0.35,"R19 Batt + R5 ci R10 Fully Underslab, 3.5' depth",3.4000000000000002E-2,0.33300000000000002,"R19 Batt + R5 ci R10 Fully Underslab, 7' depth",3.1E-2,0.307]
[{"$f":"A185+1","v":29},null,"R20 Foam Ext w/TB, R10 Full Underslab","Baylon & Kennedy, https://web.ornl.gov/sci/buildings/conf-archive/2007%20B10%20papers/092_Baylon.pdf","Added 2020 from reference","R20 Foam Ext w/TB, R10 Full Underslab, 2' depth",0.04,0.35,"R20 Foam Ext w/TB, R10 Full Underslab, 3.5' depth",3.7999999999999999E-2,0.33100000000000002,"R20 Foam Ext w/TB, R10 Full Underslab, 7' depth",3.4000000000000002E-2,0.30399999999999999]
[30,null,"R21 Batt","WSU","Updated to WSEC 2018","R21 Batt, 2' depth",0.04,0.68,"R21 Batt, 3.5' depth",3.7999999999999999E-2,0.63,"R21 Batt, 7' depth",3.5000000000000003E-2,0.56000000000000005]
[31,null,"R21 Batt w/TB","WSU","Updated to WSEC 2018","R21 Batt w/TB, 2' depth",4.2000000000000003E-2,0.59,"R21 Batt w/TB, 3.5' depth",0.04,0.56000000000000005,"R21 Batt w/TB, 7' depth",3.5000000000000003E-2,0.5]
[32,null,"R21 Batt + R5 ci","10-1","Added in  WSEC 2018","R21 Batt + R5 ci, 2' depth",3.1E-2,0.68,"R21 Batt + R5 ci, 3.5' depth",0.03,0.63200000000000001,"R21 Batt + R5 ci, 7' depth",2.7E-2,0.56000000000000005]
[33,null,"R21 Batt + R5 ci w/TB","10-1","Added in  WSEC 2018","R21 Batt + R5 ci w/TB, 2' depth",3.2000000000000001E-2,0.59,"R21 Batt + R5 ci w/TB, 3.5' depth",3.1E-2,0.56000000000000005,"R21 Batt + R5 ci w/TB, 7' depth",2.8000000000000001E-2,0.51]
[34,null,"R21 Batt + R7 ci","10-1","Added in  WSEC 2018","R21 Batt + R7 ci, 2' depth",2.9000000000000001E-2,0.68,"R21 Batt + R7 ci, 3.5' depth",2.7E-2,0.63,"R21 Batt + R7 ci, 7' depth",2.5000000000000001E-2,0.56999999999999995]
[35,null,"R21 Batt + R7 ci w/TB","10-1","Added in  WSEC 2018","R21 Batt + R7 ci w/TB, 2' depth",0.03,0.59,"R21 Batt + R7 ci w/TB, 3.5' depth",2.9000000000000001E-2,0.56000000000000005,"R21 Batt + R7 ci w/TB, 7' depth",2.5999999999999999E-2,0.56999999999999995]
[36,null,"R21 Batt + R5 ci R10 Fully Underslab","Baylon & Kennedy, https://web.ornl.gov/sci/buildings/conf-archive/2007%20B10%20papers/092_Baylon.pdf","Added 2020 from reference","R21 Batt + R5 ci R10 Fully Underslab, 2' depth",3.1E-2,0.35,"R21 Batt + R5 ci R10 Fully Underslab, 3.5' depth",3.2000000000000001E-2,0.33300000000000002,"R21 Batt + R5 ci R10 Fully Underslab, 7' depth",2.9000000000000001E-2,0.307]
[37,null,"R25 Batt w/TB","Baylon & Kennedy, https://web.ornl.gov/sci/buildings/conf-archive/2007%20B10%20papers/092_Baylon.pdf","Added 2020 from reference","R25 Batt w/TB, 2' depth",3.7999999999999999E-2,0.59299999999999997,"R25 Batt w/TB, 3.5' depth",3.5999999999999997E-2,0.55700000000000005,"R25 Batt w/TB, 7' depth",3.2000000000000001E-2,0.505]
[38,null,"R25 Batt w/TB, R10 Full Underslab","Baylon & Kennedy, https://web.ornl.gov/sci/buildings/conf-archive/2007%20B10%20papers/092_Baylon.pdf","Added 2020 from reference","R25 Batt w/TB, R10 Full Underslab, 2' depth",0.04,0.35,"R25 Batt w/TB, R10 Full Underslab, 3.5' depth",3.7999999999999999E-2,0.33100000000000002,"R25 Batt w/TB, R10 Full Underslab, 7' depth",3.4000000000000002E-2,0.30399999999999999]
[null,null,{"$f":"'Below Grade Walls & Slabs'!C119","v":"== Custom Entries per WSEC R402.1.5 U-factor Reference and Calculations ========  "},null,null,null,"Wall U","Slab F"]
[{"$f":"'Below Grade Walls & Slabs'!A120","v":112},null,{"$f":"IF('Below Grade Walls & Slabs'!C120=\"\",\"\",'Below Grade Walls & Slabs'!C120)","v":""},"Custom",null,null,{"$f":"'Below Grade Walls & Slabs'!$E120","v":0},{"$f":"'Below Grade Walls & Slabs'!$F120","v":0}]
[{"$f":"'Below Grade Walls & Slabs'!A121","v":113},null,{"$f":"IF('Below Grade Walls & Slabs'!C121=\"\",\"\",'Below Grade Walls & Slabs'!C121)","v":""},"Custom",null,null,{"$f":"'Below Grade Walls & Slabs'!$E121","v":0},{"$f":"'Below Grade Walls & Slabs'!$F121","v":0}]
[{"$f":"'Below Grade Walls & Slabs'!A122","v":114},null,{"$f":"IF('Below Grade Walls & Slabs'!C122=\"\",\"\",'Below Grade Walls & Slabs'!C122)","v":""},"Custom",null,null,{"$f":"'Below Grade Walls & Slabs'!$E122","v":0},{"$f":"'Below Grade Walls & Slabs'!$F122","v":0}]
[{"$f":"'Below Grade Walls & Slabs'!A123","v":115},null,{"$f":"IF('Below Grade Walls & Slabs'!C123=\"\",\"\",'Below Grade Walls & Slabs'!C123)","v":""},"Custom",null,null,{"$f":"'Below Grade Walls & Slabs'!$E123","v":0},{"$f":"'Below Grade Walls & Slabs'!$F123","v":0}]
[{"$f":"'Below Grade Walls & Slabs'!A124","v":116},null,{"$f":"IF('Below Grade Walls & Slabs'!C124=\"\",\"\",'Below Grade Walls & Slabs'!C124)","v":""},"Custom",null,null,{"$f":"'Below Grade Walls & Slabs'!$E124","v":0},{"$f":"'Below Grade Walls & Slabs'!$F124","v":0}]
[{"$f":"'Below Grade Walls & Slabs'!A125","v":117},null,{"$f":"IF('Below Grade Walls & Slabs'!C125=\"\",\"\",'Below Grade Walls & Slabs'!C125)","v":""},"Custom",null,null,{"$f":"'Below Grade Walls & Slabs'!$E125","v":0},{"$f":"'Below Grade Walls & Slabs'!$F125","v":0}]
[{"$f":"'Below Grade Walls & Slabs'!A126","v":118},null,{"$f":"IF('Below Grade Walls & Slabs'!C126=\"\",\"\",'Below Grade Walls & Slabs'!C126)","v":""},"Custom",null,null,{"$f":"'Below Grade Walls & Slabs'!$E126","v":0},{"$f":"'Below Grade Walls & Slabs'!$F126","v":0}]
[{"$f":"'Below Grade Walls & Slabs'!A127","v":119},null,{"$f":"IF('Below Grade Walls & Slabs'!C127=\"\",\"\",'Below Grade Walls & Slabs'!C127)","v":""},"Custom",null,null,{"$f":"'Below Grade Walls & Slabs'!$E127","v":0},{"$f":"'Below Grade Walls & Slabs'!$F127","v":0}]
[null,null,"======================"]

{"sheet":"Table 406.2 (WSEC 2015)","index":14,"n_rows":119,"n_cols":3,"rows_kept":119,"cut":false,"hidden":true,"merged":[[113,1,113,2],[114,1,114,2],[115,1,115,2],[117,1,117,2],[118,1,118,2],[116,1,116,2],[10,0,10,2],[12,0,12,2],[13,0,13,2],[16,0,16,2],[2,0,2,2],[4,0,4,2],[6,0,6,2],[7,0,7,2],[9,0,9,2],[78,0,84,0],[78,2,84,2],[85,0,87,0],[85,2,87,2],[88,0,95,0],[88,2,95,2],[96,0,103,0],[96,2,103,2],[104,0,106,0],[104,2,106,2],[107,0,112,0],[107,2,112,2],[67,0,69,0],[67,2,69,2],[70,0,74,0],[70,2,74,2],[75,0,77,0],[75,2,77,2],[53,0,57,0],[53,2,57,2],[58,0,62,0],[58,2,62,2],[63,0,66,0],[63,2,66,2],[45,0,47,0],[45,2,47,2],[48,0,52,0],[48,2,52,2],[17,0,24,0],[17,2,24,2],[25,0,34,0],[25,2,34,2],[35,0,44,0],[35,2,44,2]]}
["SECTION R406"]
[]
["R406.1 Scope. This section establishes options for additional criteria to be met for one- and two-family dwellings and townhouses, as defined in Section 101.2 of the International Residential Code to demonstrate compliance with this code."]
[]
["R406.2 Additional energy efficiency requirements (Mandatory). Each dwelling unit in a residential building shall comply with sufficient options from Table R406.2 so as to achieve the following minimum number of credits:"]
["1.    Small Dwelling Unit: ","1.5 credits"]
["         Dwelling units less than 1500 square feet in conditioned floor area with less than 300 square feet of fenestration area. "]
["         Additions to existing building greater than 500 square feet of heated floor area but less than 1500 square feet."]
["2.    Medium Dwelling Unit: ","3.5 credits"]
["         All dwelling units that are not included in #1 or #3."]
["         Exception: Dwelling units serving R-2 occupancies shall require 2.5 credits."]
["3.    Large Dwelling Unit: ","4.5 credits"]
["         Dwelling units exceeding 5000 square feet of conditioned floor area."]
["         Exception: Dwelling units serving R-2 occupancies shall require 2.5 credits."]
["4.    Additions less than 500 square feet:","0.5 credits"]
[]
["The drawings included with the building permit application shall identify which options have been selected and the point value of each option, regardless of whether separate mechanical, plumbing, electrical, or other permits are utilized for the project."]
["1a","EFFICIENT BUILDING ENVELOPE 1a:",0.5]
[null,"Prescriptive compliance is based on Table R402.1.1 with the following modifications:  "]
[null,"Vertical fenestration U  = 0.28"]
[null,"Floor R-38"]
[null,"Slab on grade R-10 perimeter and under entire slab"]
[null,"Below grade slab R-10 perimeter and under entire slab"]
[null,"or"]
[null,"Compliance based on Section R402.1.4:  Reduce the Total UA by 5%."]
["1b","EFFICIENT BUILDING ENVELOPE 1b:",1]
[null,"Prescriptive compliance is based on Table R402.1.1 with the following modifications:  "]
[null,"Vertical fenestration U  = 0.25 "]
[null,"Wall R-21 plus R-4 "]
[null,"Floor R-38 "]
[null,"Basement wall R-21 int plus R-5 ci"]
[null,"Slab on grade R-10 perimeter and under entire slab"]
[null,"Below grade slab R-10 perimeter and under entire slab"]
[null,"or"]
[null,"Compliance based on Section R402.1.4:  Reduce the Total UA by 15%."]
["1c","EFFICIENT BUILDING ENVELOPE 1c:",2]
[null,"Prescriptive compliance is based on Table R402.1.1 with the following modifications:  Vertical fenestration U  = 0.22"]
[null,"Ceiling and single-rafter or joist-vaulted R-49 advanced"]
[null,"Wood frame wall R-21 int plus R-12 ci"]
[null,"Floor R-38"]
[null,"Basement wall R-21 int plus R-12 ci"]
[null,"Slab on grade R-10 perimeter and under entire slab"]
[null,"Below grade slab R-10 perimeter and under entire slab"]
[null,"or"]
[null,"Compliance based on Section R402.1.4:  Reduce the Total UA by 30%."]
["1da","EFFICIENT BUILDING ENVELOPE 1d:",0.5]
[null,"Prescriptive compliance is based on Table R402.1.1 with the following modifications:"]
[null,"Vertical fenestration U = 0.24"]
["2a","AIR LEAKAGE CONTROL AND EFFICIENT VENTILATION 2a:",0.5]
[null,"Compliance based on R402.4.1.2:  Reduce the tested air leakage to 3.0 air changes per hour maximum"]
[null,"and"]
[null,"All whole house ventilation requirements as determined by Section M1507.3 of the International Residential Code shall be met with a high efficiency fan (maximum 0.35 watts/cfm), not interlocked with the furnace fan. Ventilation systems using a furnace including an ECM motor are allowed, provided that they are controlled to operate at low speed in ventilation only mode."]
[null,"To qualify to claim this credit, the building permit drawings shall specify the option being selected and shall specify the maximum tested building air leakage and shall show the qualifying ventilation system."]
["2b","AIR LEAKAGE CONTROL AND EFFICIENT VENTILATION 2b:",1]
[null,"Compliance based on Section R402.4.1.2:  Reduce the tested air leakage to 2.0 air changes per hour maximum"]
[null,"and"]
[null,"All whole house ventilation requirements as determined by Section M1507.3 of the International Residential Code shall be met with a heat recovery ventilation system with minimum sensible heat recovery efficiency of 0.70."]
[null,"To qualify to claim this credit, the building permit drawings shall specify the option being selected and shall specify the maximum tested building air leakage and shall show the heat recovery ventilation system."]
["2c","AIR LEAKAGE CONTROL AND EFFICIENT VENTILATION 2c:",1.5]
[null,"Compliance based on Section R402.4.1.2:  Reduce the tested air leakage to 1.5 air changes per hour maximum"]
[null,"and"]
[null,"All whole house ventilation requirements as determined by Section M1507.3 of the International Residential Code shall be met with a heat recovery ventilation system with minimum sensible heat recovery efficiency of 0.85."]
[null,"To qualify to claim this credit, the building permit drawings shall specify the option being selected and shall specify the maximum tested building air leakage and shall show the heat recovery ventilation system."]
["3ab","HIGH EFFICIENCY HVAC EQUIPMENT 3a:",1]
[null,"Gas, propane or oil-fired furnace with minimum AFUE of 94%, or"]
[null,"Gas, propane or oiled-fired boiler with minimum AFUE of 92%"]
[null,"To qualify to claim this credit, the building permit drawings shall specify the option being selected and shall specify the heating equipment type and the minimum equipment efficiency."]
["3bb","HIGH EFFICIENCY HVAC EQUIPMENT 3b:",1]
[null,"Air-source heat pump with minimum HSPF of 9.0"]
[null,"To qualify to claim this credit, the building permit drawings shall specify the option being selected and shall specify the heating equipment type and the minimum equipment efficiency."]
["3cb","HIGH EFFICIENCY HVAC EQUIPMENT 3c:",1.5]
[null,"Closed-loop ground source heat pump; with a minimum COP of 3.3"]
[null,"or"]
[null,"Open loop water source heat pump with a maximum pumping hydraulic head of 150 feet and minimum COP of 3.6"]
[null,"To qualify to claim this credit, the building permit drawings shall specify the option being selected and shall specify the heating equipment type and the minimum equipment efficiency."]
["3db","HIGH EFFICIENCY HVAC EQUIPMENT 3d:",1]
[null,"Ductless Split System Heat Pumps, Zonal Control: In homes where the primary space heating system is zonal electric heating, a ductless heat pump system shall be installed and provide heating to the largest zone of the housing unit."]
[null,"To qualify to claim this credit, the building permit drawings shall specify the option being selected and shall specify the heating equipment type and the minimum equipment efficiency."]
[4,"HIGH EFFICIENCY HVAC DISTRIBUTION SYSTEM:",1]
[null,"All heating and cooling system components installed inside the conditioned space. This includes all equipment and distribution system components such as forced air ducts, hydronic piping, hydronic floor heating loop, convectors and radiators. All combustion equipment shall be direct vent or sealed combustion."]
[null,"For forced air ducts: A maximum of 10 linear feet of return ducts and 5 linear feet of supply ducts may be located outside the conditioned space. All metallic ducts located outside the conditioned space must have both transverse and longitudinal joints sealed with mastic. If flex ducts are used, they cannot contain splices. Flex duct connections must be made with nylon straps and installed using a plastic strapping tensioning tool. Ducts located outside the conditioned space must be insulated to a minimum of R-8."]
[null,"Locating system components in conditioned crawl spaces is not permitted under this option."]
[null,"Electric resistance heat and ductless heat pumps are not permitted under this option."]
[null,"Direct combustion heating equipment with AFUE less than 80% is not permitted under this option."]
[null,"To qualify to claim this credit, the building permit drawings shall specify the option being selected and shall specify the heating equipment type and shall show the location of the heating and cooling equipment and all the ductwork."]
["5a","EFFICIENT WATER HEATING 5a:",0.5]
[null,"All showerhead and kitchen sink faucets installed in the house shall be rated at 1.75 GPM or less. All other lavatory faucets shall be rated at 1.0 GPM or less.c"]
[null,"To qualify to claim this credit, the building permit drawings shall specify the option being selected and shall specify the maximum flow rates for all showerheads, kitchen sink faucets, and other lavatory faucets."]
["5b","EFFICIENT WATER HEATING 5b:",1]
[null,"Water heating system shall include one of the following:"]
[null,"Gas, propane or oil water heater with a minimum EF of 0.74"]
[null,"or"]
[null,"Water heater heated by ground source heat pump meeting the requirements of Option 3c."]
[null,"or"]
[null,"For R-2 occupancy, a central heat pump water heater with an EF greater than 2.0 that would supply DHW to all the units through a central water loop insulated with R-8 minimum pipe insulation."]
[null,"To qualify to claim this credit, the building permit drawings shall specify the option being selected and shall specify the water heater equipment type and the minimum equipment efficiency."]
["5c","EFFICIENT WATER HEATING 5c:",1.5]
[null,"Water heating system shall include one of the following:"]
[null,"Gas, propane or oil water heater with a minimum EF of 0.91"]
[null,"or"]
[null,"Solar water heating supplementing a minimum standard water heater. Solar water heating will provide a rated minimum savings of 85 therms or 2000 kWh based on the Solar Rating and Certification Corporation (SRCC) Annual Performance of OG-300 Certified Solar Water Heating Systems."]
[null,"or"]
[null,"Electric heat pump water heater with a minimum EF of 2.0 and meeting the standards of NEEA's Northern Climate Specifications for Heat Pump Water Heaters."]
[null,"To qualify to claim this credit, the building permit drawings shall specify the option being selected and shall specify the water heater equipment type and the minimum equipment efficiency and, for solar water heating systems, the calculation of the minimum energy savings."]
["5d","EFFICIENT WATER HEATING 5d:",0.5]
[null,"A drain water heat recovery unit(s) shall be installed, which captures waste water heat from all the showers, and has a minimum efficiency of 40% if installed for equal flow or a minimum efficiency of 52% if installed for unequal flow. Such units shall be rated in accordance with CSA B55.1 and be so labeled."]
[null,"To qualify to claim this credit, the building permit drawings shall include a plumbing diagram that specifies the drain water heat recovery units and the plumbing layout needed to install it and labels or other documentation shall be provided that demonstrates that the unit complies with the standard."]
[6,"RENEWABLE ELECTRIC ENERGY:",0.5]
[null,"For each 1200 kWh of electrical generation per housing unit provided annually by on-site wind or solar equipment a 0.5 credit shall be allowed, up to 3 credits. Generation shall be calculated as follows:"]
[null,"For solar electric systems, the design shall be demonstrated to meet this requirement using the National Renewable Energy Laboratory calculator PVWATTs. Documentation noting solar access shall be included on the plans."]
[null,"For wind generation projects designs shall document annual power generation based on the following factors:"]
[null,"The wind turbine power curve; average annual wind speed at the site; frequency distribution of the wind speed at the site and height of the tower."]
[null,"To qualify to claim this credit, the building permit drawings shall specify the option being selected and shall show the photovoltaic or wind turbine equipment type, provide documentation of solar and wind access, and include a calculation of the minimum annual energy power production."]
["a.","Projects using this option may not use Option 1a, 1b or 1c."]
["b.","Projects may only include credit from one space heating option, 3a, 3b, 3c or 3d. When a housing unit has two pieces of equipment (i.e., two furnaces) both must meet the standard to receive the credit."]
["c.","Plumbing Fixtures Flow Ratings. Low flow plumbing fixtures (water closets and urinals) and fittings (faucets and showerheads) shall comply with the following requirements:"]
[null,"1.        Residential bathroom lavatory sink faucets: Maximum flow rate - 3.8 L/min (1.0 gal/min) when tested in accordance with ASME A112.18.1/CSA B125.1."]
[null,"2.        Residential kitchen faucets: Maximum flow rate - 6.6 L/min (1.75 gal/min) when tested in accordance with ASME A112.18.1/CSA B125.1."]
[null,"3.        Residential showerheads: Maximum flow rate - 6.6 L/min (1.75 gal/min) when tested in accordance with ASME A112.18.1/CSA B125.1."]

{"sheet":"Weather","index":15,"n_rows":240,"n_cols":6,"rows_kept":240,"cut":false,"hidden":true,"merged":[]}
["WSU Code Compliance Calculator  - WSEC 2015 &2018",null,null,null,null,"(C) 2020"]
["Weather Database - Heating Design Temperature by City, Washington State"]
["Index","Location","Heating","Design"]
[null,null,"Design","Temp"]
[null,null,"Temp","Difference"]
[1]
[2,"Aberdeen 20 NNE",25,{"$f":"70-C7","v":45}]
[3,"Anacortes",24,{"$f":"70-C8","v":46}]
[4,"Anatone",-4,74]
[5,"Appleton",11,59]
[6,"Auburn",25,45]
[7,"Battleground",19,51]
[8,"Bellevue",24,46]
[9,"Bellingham 2N",19,51]
[10,"Benton City 2 NW",11,59]
[11,"Bickleton",4,66]
[12,"Blaine",17,53]
[13,"Bothell 2 N",17,53]
[14,"Bremerton",29,41]
[15,"Brier",24,46]
[16,"Buckley 1 NE",26,44]
[17,"Bumping Lake",-5,75]
[18,"Burlington",19,51]
[19,"Camas",21,49]
[20,"Castle Rock",23,47]
[21,"Cedar Lake",20,50]
[22,"Centralia",21,49]
[23,"Central Park",27,43]
[24,"Chehalis",21,49]
[25,"Chelan",10,60]
[26,"Cheney",4,66]
[27,"Chesaw",-11,81]
[28,"Chewalah 2 S",-9,79]
[29,"Chief Joseph Dam",6,64]
[30,"Clallam Bay 1 NNE",28,42]
[31,"Clarkston",10,60]
[32,"Clearbrook",19,51]
[33,"Clearwater",26,44]
[34,"Cle Elum",1,69]
[35,"Clyde Hill",24,46]
[36,"Colfax 1 NW",2,68]
[37,"College Place",6,64]
[38,"Colville AP",-2,72]
[39,"Conconully",-7,77]
[40,"Concrete",19,51]
[41,"Connell 4 NNW",6,64]
[42,"Cougar 5 E",25,45]
[43,"Coulee Dam 1 SW",9,61]
[44,"Coupeville 1 S",21,49]
[45,"Cushman Dam",22,48]
[46,"Dallesport AP",14,56]
[47,"Darrington RS",13,57]
[48,"Davenport",5,65]
[49,"Dayton 1 WSW",5,65]
[50,"Deer Park 2 E",-5,75]
[51,"Des Moines",25,45]
[52,"Diablo Dam",15,55]
[53,"Dishman",9,61]
[54,"East Bremerton",29,41]
[55,"Edmonds",24,46]
[56,"Electron Headwks",16,54]
[57,"Ellensburg AP",2,68]
[58,"Elma",24,46]
[59,"Eltopia 6 W",9,61]
[60,"Elwha RS",24,46]
[61,"Enumclaw",26,44]
[62,"Ephrata AP",7,63]
[63,"Everett JC",23,47]
[64,"Everett Paine AFB",21,49]
[65,"Fircrest",29,41]
[66,"Forks I E",23,47]
[67,"Fort Lewis",24,{"$f":"70-C72","v":46}]
[68,"Fruitvale",1.1000000000000001,68.900000000000006]
[69,"Glacier RS",13,57]
[70,"Glenoma (Kosmos)",18,52]
[71,"Goldendale",7,63]
[72,"Grandview",12,58]
[73,"Grapeview",30,40]
[74,"Grayland 2 S",28,42]
[75,"Grays River Hatchery",24,46]
[76,"Greenwater",1.4,68.599999999999994]
[77,"Grotto",21,49]
[78,"Harrington 2 S",3,67]
[79,"Hartline",7,63]
[80,"Hatton 8 E",1,69]
[81,"Holden Village",4,66]
[82,"Hoquiam AP",26,44]
[83,"Ice Harbor Dam",17,53]
[84,"Inchelium 2 NW",0,70]
[85,"Issaquah",23,47]
[86,"John Day Dam",19,51]
[87,"Kelso AP",24,46]
[88,"Kennewick 10 SW",13,57]
[89,"Kent",21,49]
[90,"Kid Valley",20,50]
[91,"Kirkland",17,53]
[92,"Lacey",17,53]
[93,"Lacrosse 3 ESE",-3,73]
[94,"La Grande",23,47]
[95,"Lake Cle Elum",-4,74]
[96,"Lake Forest Park",20,50]
[97,"Lake Kachess",-2,72]
[98,"Lake Keechelus",0,70]
[99,"Lakewood Center",23,47]
[100,"Landsburg",18,52]
[101,"Larson AFB",6,64]
[102,"Laurier",-8,78]
[103,"Leavenworth",-3,73]
[104,"Lemanasky Lake",-7,77]
[105,"Lind 3 NE",6,64]
[106,"Linwood",10,60]
[107,"Little Goose Dam",22,48]
[108,"Long Beach 3 NNE",25,45]
[109,"Longview",24,46]
[110,"Lower Granite Dam",14,56]
[111,"Lower Monument Dam",18,52]
[112,"Lynden",18,52]
[113,"Lynnwood",24,46]
[114,"Maloft",4,66]
[115,"Marietta 3 NNW",18,52]
[116,"Marysville",23,47]
[117,"McMillin Res.",21,49]
[118,"McNary Dam",11,59]
[119,"Medical Lake",4,66]
[120,"Medina",24,46]
[121,"Mercer Island",25,45]
[122,"Metaline Falls",-1,71]
[123,"Methow 2 W",1,69]
[124,"Mountlake Terrace",22,48]
[125,"Mt. Spokane Summit",-2,72]
[126,"Mount Vernon 3 WNW",20,50]
[127,"Moxee City 10 E",8,62]
[128,"Mud Mtn. Dam",23,47]
[129,"Nespelem 2 S",-4,74]
[130,"Newhalem",19,51]
[131,"Newport",-5,{"$f":"70-C136","v":75}]
[132,"Normandy Park",24,46]
[133,"Northport",2,68]
[134,"Oak Harbor",16,54]
[135,"Oakville",20,50]
[136,"Odessa",7,63]
[137,"Olga 2 SE",24,46]
[138,"Olympia, AP.",17,53]
[139,"Omak 2 NW",3,67]
[140,"Opportunity",8,62]
[141,"Oroville",5,65]
[142,"Othello",9,61]
[143,"Packwood",16,54]
[144,"Palmer 3 SE",22,48]
[145,"Parkland",20,50]
[146,"Pasco",13,57]
[147,"Plain",-3,73]
[148,"Pleasant View",16,54]
[149,"Pt. Grenville",27,43]
[150,"Pomeroy",3,67]
[151,"Port Angeles",28,42]
[152,"Port Orchard",29,41]
[153,"Pon Townsend",25,45]
[154,"Priest Rapids Dam",14,56]
[155,"Prosser",12,58]
[156,"Pullman Exp. Sta.",1,69]
[157,"Puyallup",19,51]
[158,"Quilcene 2 SW",23,47]
[159,"Quillayute AP",23,47]
[160,"Quinault RS",25,45]
[161,"Quincy 1 NE",4,66]
[162,"Rainier, Longmire",15,55]
[163,"Paradise RS",8,62]
[164,"Raymond",28,42]
[165,"Redmond",17,53]
[166,"Renton",24,46]
[167,"Republic",-9,79]
[168,"Richland",11,59]
[169,"Rimrock Tieton Dam",4,66]
[170,"Ritzville",6,64]
[171,"Rosalia",6,64]
[172,"Ross Dam",14,56]
[173,"St. John",15,55]
[174,"Sappho 8 E",23,47]
[175,"Satus Pass",10,60]
[176,"Seattle: Sea-Tac AP",24,46]
[177,"Sedro Woolley 1 E",19,51]
[178,"Selah",11,59]
[179,"Sequim",23,47]
[180,"Shelton",23,47]
[181,"Shoultes",23,47]
[182,"Skamania Fish Hatch.",24,46]
[183,"Smyrna",8,62]
[184,"Snohomish",21,49]
[185,"Snoqualmie Falls",22,48]
[186,"Snoqualmie Pass",6,64]
[187,"South Broadway",11,59]
[188,"So. Olympic Tree Farm",24,46]
[189,"Spanaway",20,50]
[190,"Spokane AP",4,66]
[191,"Spokane CO",10,60]
[192,"Spokane Fairchild AFB",4,66]
[193,"Sprague",4,66]
[194,"Stampede Pass",7,63]
[195,"Startup 1 E",20,{"$f":"70-C200","v":50}]
[196,"Stehekin 3 NW",12,58]
[197,"Steilacoom",21,49]
[198,"Stevens Pass",6,64]
[199,"Stockdill Ranch",-14,84]
[200,"Sumner",19,51]
[201,"Sunnyside",12,58]
[202,"Tacoma McChord",21,49]
[203,"Tacoma CO",29,41]
[204,"Tatoosh Island",31,39]
[205,"Thompson Place",20,50]
[206,"Tietort Intake",6,64]
[207,"Toledo AP",17,53]
[208,"Toppenish",11,59]
[209,"Trinidad 2 SSE",13,57]
[210,"Tukwila",24,46]
[211,"Tumwater",17,53]
[212,"University Place",29,41]
[213,"Upper Baker Dam",14,56]
[214,"Vancouver",22,48]
[215,"Vashon Island",28,42]
[216,"Walla Walla AP",6,64]
[217,"Walla Walla CO",13,57]
[218,"Wapato",10,60]
[219,"Washougal 8 ENE",21,49]
[220,"Waterville",1,69]
[221,"Wawawai 2 NW",14,56]
[222,"Wellpinit",1,69]
[223,"Wenatchee AP",13,57]
[224,"Wenatchee CO",10,60]
[225,"West Clarkston",10,60]
[226,"Whidbey Island",11,59]
[227,"White River RS",12,58]
[228,"White Swan RS",8,62]
[229,"Whitman Mission",11,59]
[230,"Wilbur",4,66]
[231,"Willapa Harbor",26,44]
[232,"Wilson Creek",3,67]
[233,"Wind River",15,55]
[234,"Winthrop 1 WSW",-12,82]
[235,"Yakima AP",11,59]

{"sheet":"Prototypes","index":16,"n_rows":20,"n_cols":61,"rows_kept":20,"cut":false,"hidden":true,"merged":[]}
[]
["Prototypes"]
["id_prototypes","prototype","Tons","Furnsize","Supply Duct location","Supply Duct Area","Return Duct location","Return Duct Area","Afloorcon","Volume","Afloorext","Aextwall","Aceiling","AwinN","AwinE","AwinS","AwinW","Adoor","Foundtype","Afootprint","Pfootprint","HeightAG","HeightBG","StackHeight","FanCFM","achattic","achcrawl","WH","WH_size","HPWH_performance","ducted","WH_fan","WH_loc","InteractionFactor","prototype_desc","btype","occupants_per_unit","occupants","numunits","height_per_floor","floors_per_building","total_height","baseductsinside","bedrooms_per_unit","reqvent","glazing_pct_hfa","perim_width","perim_length","seemtemplate_sort","official_rtf_prototype","sqft_per_unit","sizecat","fan_cfm_per_unit","wh_size_per_unit","floor_ins_area","wall_ins_area","bsmtwall_ins_area","window_area","slab_area","wall_to_floor_area","duct_area"]
[1,"c1344",2.5,17.584272626562804,"Crawl",240,"Attic",50,1344,10752,0,1184,1344,43.68,43.68,43.68,43.68,40,1,1344,148,1,2,8,50,4.5,4.5,1,50,4,0,0,1,0.65,"sf home","sf",2.3918495297805644,2.3918495297805644,1,8,1,8,false,3,70.319999999999993,0.13,32,42,1,true,1344,1500,50,50,1344,969.28,0,174.72,0,0.88095238095238093,290]
[2,"s1344",2.5,17.584272626562804,"Attic",240,"Attic",50,1344,10752,0,1184,1344,43.68,43.68,43.68,43.68,40,2,1344,148,0,0,8,50,4.5,4.5,1,50,4,0,0,1,0.65,"sf home","sf",2.3918495297805644,2.3918495297805644,1,8,1,8,false,3,70.319999999999993,0.13,32,42,1,true,1344,1500,50,50,0,969.28,0,174.72,1344,0.88095238095238093,290]
[3,"c2200",4,23.445696835417071,"Crawl",300,"Attic",80,2200,18700,200,2210,1784,91.300000000000011,91.300000000000011,91.300000000000011,91.300000000000011,40,1,1584,160,1,2,17,50,4.5,4.5,1,50,4,0,0,1,0.65,"sf home","sf",2.7944162436548226,2.7944162436548226,1,8.5,2,17,false,4,103.5,0.16600000000000001,36,44,2,true,2200,5000,50,50,1784,1804.8,0,365.20000000000005,0,1.0045454545454546,380]
[4,"s2200",4,23.445696835417071,"Attic",300,"Attic",80,2200,18700,200,2210,1784,91.300000000000011,91.300000000000011,91.300000000000011,91.300000000000011,40,2,1584,160,0,0,17,50,4.5,4.5,1,50,4,0,0,1,0.65,"sf home","sf",2.7944162436548226,2.7944162436548226,1,8.5,2,17,false,4,103.5,0.16600000000000001,36,44,2,true,2200,5000,50,50,200,1804.8,0,365.20000000000005,1584,1.0045454545454546,380]
[5,"b2688",3.5,17.584272626562804,"In",0,"Attic",40,2688,22848,0,1480,1344,94.080000000000013,94.080000000000013,94.080000000000013,94.080000000000013,40,4,1344,148,0.5,6.5,10,50,4.5,4.5,1,50,4,0,0,4,0.65,"sf home","sf",2.946236559139785,2.946236559139785,1,10,2,20,false,4,118.14,0.14000000000000001,32,42,3,true,2688,5000,50,50,0,1063.6799999999998,1036,376.32000000000005,0,0.93601190476190477,40]
[6,"b5000",6,35.168545253125608,"In",0,"Attic",60,5000,40100,200,2788,1800,187.5,187.5,187.5,187.5,40,4,1600,164,0.5,6.5,17,50,4.5,4.5,1,50,4,0,0,4,0.65,"sf home","sf",3.9355662368310997,3.9355662368310997,1,10,3,30,false,4,187.5,0.15,32,50,null,false,5000,9999,50,50,200,1998,1148,750,0,0.78720000000000001,60]
[7,"c2460",6,23.445696835417071,"In",280,"In",70,2460,20910,0,2193,820,92.25,92.25,92.25,92.25,60,1,821.5,86,1,2,25.5,150,4.5,4.5,1,150,4,0,0,1,0.65,"garden style","mf",2.25,6.75,3,8.5,3,25.5,true,2,141.29999999999998,0.15,26.5,31,null,false,820,1500,50,50,821.5,1764,0,369,0,0.89146341463414636,350]
[]
["vvvvvvvv Not used in 2018 WSREC Analysis",null,null,null,null,null,null,null,"Not used in 2018 WSREC Analysis",null,null,null,"Not used in 2018 WSREC Analysis",null,null,null,"Not used in 2018 WSREC Analysis",null,null,null,"Not used in 2018 WSREC Analysis",null,null,null,"Not used in 2018 WSREC Analysis",null,null,null,"Not used in 2018 WSREC Analysis"]
[10,"c1500",6,35.168545253125608,"Crawl",100,"Attic",50,1500,14250,0,1259,500,48.75,48.75,48.75,48.75,40,1,500,90,1,2,28.5,50,4.5,4.5,1,50,4,0,0,1,0.65,"townhome","sf",1.69,1.69,1,9.5,3,28.5,false,3,75,0.13,20,25,4,true,1500,5000,50,50,500,1024,0,195,0,0.83933333333333338,150]
[{"$f":"A13+1","v":11},"s1500",6,35.168545253125608,"Attic",20,"Attic",50,1500,14250,0,1259,500,48.75,48.75,48.75,48.75,40,2,500,90,0,0,28.5,50,4.5,4.5,1,50,4,0,0,1,0.65,"townhome","sf",1.69,1.69,1,9.5,3,28.5,false,3,75,0.13,20,25,5,true,1500,5000,50,50,0,1024,0,195,500,0.83933333333333338,70]
[{"$f":"A14+1","v":12},"s1000",6,35.168545253125608,"In",0,"In",0,26400,237600,0,10152,8800,990,990,990,990,84,2,8800,376,0,0,27,1200,4.5,4.5,1,1200,4,0,0,1,0.65,"double loaded corridor","mf",1.69,40.56,24,9,3,27,true,2,1332,0.15,88,100,6,true,1100,1500,50,50,0,6108,0,3960,8800,0.38454545454545452,0]
[13,"c1904",4,17.584272626562804,"In",280,"In",70,1904,16184,0,1632,952,71.399999999999991,71.399999999999991,71.399999999999991,71.399999999999991,40,1,952,96,1,2,17,100,4.5,4.5,1,100,4,0,0,1,0.65,"garden style","mf",1.69,3.38,2,8.5,2,17,true,2,102.12,0.15,28,34,7,false,952,1500,50,50,952,1306.4000000000001,0,285.59999999999997,0,0.8571428571428571,350]
[14,"c2856",6,23.445696835417071,"In",280,"In",70,2856,24276,0,2448,952,107.1,107.1,107.1,107.1,60,1,952,96,1,2,25.5,150,4.5,4.5,1,150,4,0,0,1,0.65,"garden style","mf",1.69,5.07,3,8.5,3,25.5,true,2,153.18,0.15,28,34,7,false,952,1500,50,50,952,1959.6,0,428.4,0,0.8571428571428571,350]
[15,"s1904",4,17.584272626562804,"In",280,"In",70,1904,16184,0,1632,952,71.399999999999991,71.399999999999991,71.399999999999991,71.399999999999991,40,2,952,96,0,0,17,100,4.5,4.5,1,100,4,0,0,1,0.65,"garden style","mf",1.69,3.38,2,8.5,2,17,true,2,102.12,0.15,28,34,7,false,952,1500,50,50,0,1306.4000000000001,0,285.59999999999997,952,0.8571428571428571,350]
[16,"s2856",6,23.445696835417071,"In",280,"In",70,2856,24276,0,2448,952,107.1,107.1,107.1,107.1,60,2,952,96,0,0,25.5,150,4.5,4.5,1,150,4,0,0,1,0.65,"garden style","mf",1.69,5.07,3,8.5,3,25.5,true,2,153.18,0.15,28,34,7,false,952,1500,50,50,0,1959.6,0,428.4,952,0.8571428571428571,350]
[17,"s952",6,35.168545253125608,"In",280,"In",70,7616,64736,0,6528,3808,285.60000000000002,285.60000000000002,285.60000000000002,285.60000000000002,160,2,3808,328,0,0,17,400,4.5,4.5,1,400,4,0,0,1,0.65,"garden style","sf",1.69,13.52,8,8.5,2,17,true,2,408.48,0.15000000000000002,28,136,7,true,952,1500,50,50,0,5225.6000000000004,0,1142.4000000000001,3808,0.8571428571428571,350]

{"sheet":"Agreement Not Accepted","index":17,"n_rows":12,"n_cols":2,"rows_kept":12,"cut":false,"hidden":true,"merged":[]}
[]
[null,"Total UA Alternative Calculator"]
[]
[null,"Terms of use were not accepted. "]
[]
[null," Please click on \"Review & Accept Terms of Use\" button below to try again. "]
[]
[null,"For Assistance please contact:"]
[null,"Carolyn Roos"]
[null,"Washington State University Energy Program"]
[null,"roosc@energy.wsu.edu"]
[null,"Please include 'UA Alternative Calculator' in the subject line."]

{"sheet":"UserRegistration","index":18,"n_rows":17,"n_cols":2,"rows_kept":17,"cut":false,"hidden":true,"merged":[]}
["User Registration",{"$f":"'Group R'!E2","v":0}]
[]
["First Name","Carolyn"]
["Last Name","Roos"]
["Registration Date:","2020-08-15"]
["Version","Version: 2015-2018 Total UA Alternative Worksheet~20200814a~C2200-1.xlsm, 8/14/2020 7:04:19 PM"]
["Company","WSUEP"]
["Demographic"]
["ContactInfo1"]
["ContactInfo2"]
["ContactInfo3"]
["ContactInfo4"]
["City","Olympia"]
["State"]
["Zipcode"]
["Add to Mailing List?","No"]
["Registrations with this file",1]